{"text_format":"3","workbook":"xlsx","n_sheets":28,"sheets":["Veiledning","Veileder stemmeverktøy","Veileder samlet risiko","Innledning","Forside","Samlet risiko","Stemmeverktøy","Lists","Mål 1","Mål 2","Mål 3","Mål 4","Mål 5","Mål 6","Mål 7","Mål 8","Mål 9","Mål 10","Mål 11","Mål 12","Mål 13","Mål 14","Mål 15","Mål 16","Mål 17","Mål 18","Mål 19","Mål 20"],"not_rendered":{"charts":22,"images":8,"defined_names":28,"comments":20},"read":"whole","date_system":"1900"}

{"sheet":"Veiledning","index":0,"n_rows":2,"n_cols":2,"rows_kept":2,"merged":[[0,1,0,12],[1,1,1,8]]}
[null,"Veileder til risikovurderingsverktøy"]
[null,"Klikk på stegene i prosessen for å få veiledning!"]

{"sheet":"Veileder stemmeverktøy","index":1,"n_rows":1,"n_cols":1,"rows_kept":1}
["Veileder ved bruk av stemmeverktøy:"]

{"sheet":"Veileder samlet risiko","index":2,"n_rows":3,"n_cols":2,"rows_kept":3}
["Veileder: Samlet risikovurdering - målnivå"]
[]
[null,"I de tilfeller hvor mange mål skal risikovurderes kan det være hensiktsmessig å få en oversikt over hvilke mål som samlet er mest eksponert for risiko. Dette kan være nyttig i forhold til å prioritere det videre arbeidet med å etablere tiltak. \nDet er viktig å være oppmerksom på at grafen viser en gjennomsnittlig risikoeksponering for det enkelte mål, og at det derfor kan være enkelte risikoelementer som er betydelige i forhold til målet, selv om den gjennomsnittlige risikoen er lav.\n\nOversikt over ”Samlet risikovurdering - målnivå” utarbeides automatisk etter hvert som risikovurderinger gjøres for det enkelte mål."]

{"sheet":"Innledning","index":3,"n_rows":3,"n_cols":2,"rows_kept":3,"merged":[[1,1,1,6],[2,1,2,6]]}
[]
[null,"Risikovurderingsverktøy"]
[null,"Innledning"]

{"sheet":"Forside","index":4,"n_rows":26,"n_cols":8,"rows_kept":26,"merged":[[0,1,0,6],[1,0,1,1],[1,2,1,6],[2,0,2,1],[2,2,2,6],[3,2,3,6],[4,2,4,6],[5,2,5,4],[5,5,5,6],[9,1,10,1],[16,1,17,1]]}
[null,"Risikovurderingsverktøy"]
["Risikovurdering for:",null,"Tjenesteområde <<tjenesteområde>>"]
["Deltakere i prosessen:",null,"<<deltakere>>"]
[null,"Dato:"]
[null,"Ansvarlig:","<<ansvarlig>>"]
[null,null,"Risikovurdering av det enkelte mål:",null,null,"Utfylte mål:"]
[{"$nulls":5},{"$f":"IF(G7=\"\",\"\",\"Mål 1\")","v":"Mål 1"},{"$f":"IF('Mål 1'!$A$4=\"\",\"\",'Mål 1'!$A$4)","v":"Utsendelse av sakslister og protokoller innen gitte frister, samt et godt fungerede sekretariat"}," "]
[{"$nulls":5},{"$f":"IF(G8=\"\",\"\",\"Mål 2\")","v":""},{"$f":"IF('Mål 2'!$A$4=\"\",\"\",'Mål 2'!$A$4)","v":""}," "]
[{"$nulls":5},{"$f":"IF(G9=\"\",\"\",\"Mål 3\")","v":""},{"$f":"IF('Mål 3'!$A$4=\"\",\"\",'Mål 3'!$A$4)","v":""}," "]
[null,"Andre verktøy:",{"$nulls":3},{"$f":"IF(G10=\"\",\"\",\"Mål 4\")","v":""},{"$f":"IF('Mål 4'!$A$4=\"\",\"\",'Mål 4'!$A$4)","v":""}," "]
[{"$nulls":5},{"$f":"IF(G11=\"\",\"\",\"Mål 5\")","v":""},{"$f":"IF('Mål 5'!$A$4=\"\",\"\",'Mål 5'!$A$4)","v":""}," "]
[{"$nulls":5},{"$f":"IF(G12=\"\",\"\",\"Mål 6\")","v":""},{"$f":"IF('Mål 6'!$A$4=\"\",\"\",'Mål 6'!$A$4)","v":""}," "]
[{"$nulls":5},{"$f":"IF(G13=\"\",\"\",\"Mål 7\")","v":""},{"$f":"IF('Mål 7'!$A$4=\"\",\"\",'Mål 7'!$A$4)","v":""}," "]
[{"$nulls":5},{"$f":"IF(G14=\"\",\"\",\"Mål 8\")","v":""},{"$f":"IF('Mål 8'!$A$4=\"\",\"\",'Mål 8'!$A$4)","v":""}," "]
[{"$nulls":5},{"$f":"IF(G15=\"\",\"\",\"Mål 9\")","v":""},{"$f":"IF('Mål 9'!$A$4=\"\",\"\",'Mål 9'!$A$4)","v":""}," "]
[{"$nulls":5},{"$f":"IF(G16=\"\",\"\",\"Mål 10\")","v":""},{"$f":"IF('Mål 10'!$A$4=\"\",\"\",'Mål 10'!$A$4)","v":""}," "]
[null,"Veiledere:",{"$nulls":3},{"$f":"IF(G17=\"\",\"\",\"Mål 11\")","v":""},{"$f":"IF('Mål 11'!$A$4=\"\",\"\",'Mål 11'!$A$4)","v":""}," "]
[{"$nulls":5},{"$f":"IF(G18=\"\",\"\",\"Mål 12\")","v":""},{"$f":"IF('Mål 12'!$A$4=\"\",\"\",'Mål 12'!$A$4)","v":""}," "]
[{"$nulls":5},{"$f":"IF(G19=\"\",\"\",\"Mål 13\")","v":""},{"$f":"IF('Mål 13'!$A$4=\"\",\"\",'Mål 13'!$A$4)","v":""}," "]
[{"$nulls":5},{"$f":"IF(G20=\"\",\"\",\"Mål 14\")","v":""},{"$f":"IF('Mål 14'!$A$4=\"\",\"\",'Mål 14'!$A$4)","v":""}," "]
[{"$nulls":5},{"$f":"IF(G21=\"\",\"\",\"Mål 15\")","v":""},{"$f":"IF('Mål 15'!$A$4=\"\",\"\",'Mål 15'!$A$4)","v":""}," "]
[{"$nulls":5},{"$f":"IF(G22=\"\",\"\",\"Mål 16\")","v":""},{"$f":"IF('Mål 16'!$A$4=\"\",\"\",'Mål 16'!$A$4)","v":""}," "]
[{"$nulls":5},{"$f":"IF(G23=\"\",\"\",\"Mål 17\")","v":""},{"$f":"IF('Mål 17'!$A$4=\"\",\"\",'Mål 17'!$A$4)","v":""}," "]
[{"$nulls":5},{"$f":"IF(G24=\"\",\"\",\"Mål 18\")","v":""},{"$f":"IF('Mål 18'!$A$4=\"\",\"\",'Mål 18'!$A$4)","v":""}," "]
[{"$nulls":5},{"$f":"IF(G25=\"\",\"\",\"Mål 19\")","v":""},{"$f":"IF('Mål 19'!$A$4=\"\",\"\",'Mål 19'!$A$4)","v":""}," "]
[{"$nulls":5},{"$f":"IF(G26=\"\",\"\",\"Mål 20\")","v":""},{"$f":"IF('Mål 20'!$A$4=\"\",\"\",'Mål 20'!$A$4)","v":""}," "]

{"sheet":"Samlet risiko","index":5,"n_rows":433,"n_cols":28,"rows_kept":433,"merged":[[0,1,0,2],[0,6,0,8],[1,2,1,8],[2,2,2,8],[3,3,3,5],[3,6,3,8],[3,22,3,23],[3,24,3,25]]}
[null,"Samlet risikovurdering - målnivå"]
[null,"Enhet:",{"$f":"IF(Forside!C$2=\"\",\"\",Forside!C$2)","v":"Tjenesteområde <<tjenesteområde>>"}]
[null,"Dato:",{"$f":"IF(Forside!C$4=\"\",\"\",Forside!C$4)","v":""}]
[{"$nulls":3},"Risiko før tiltak",null,null,"Risiko etter tiltak",{"$nulls":15},"Før tiltak",null,"Etter tiltak"]
[null,"Mål / krav:","Målnr","Sannsynlighet","Konsekvens","Risiko-nivå","Sannsynlighet","Konsekvens","Risiko-nivå",{"$nulls":13},"X-forskyv konsekv","Y-forskyv Sanns","X-forskyv konsekv","Y-forskyv Sanns"]
[null,{"$f":"IF('Mål 1'!$A$4=\"\",0,'Mål 1'!$A$4)","v":"Utsendelse av sakslister og protokoller innen gitte frister, samt et godt fungerede sekretariat"},"M 1",{"$f":"IF('Mål 1'!$E$6=\"\",0,'Mål 1'!$E$6)","v":2},{"$f":"IF('Mål 1'!$F$6=\"\",0,'Mål 1'!$F$6)","v":3},{"$f":"IF(E6*D6=0,\"\",VLOOKUP(D6,Lists!B$10:G$14,CEILING(E6-0.5,1)+1,TRUE))","v":"Middels"},{"$f":"IF('Mål 1'!$L$6=\"\",0,'Mål 1'!$L$6)","v":{"v":0,"d":"0.0"}},{"$f":"IF('Mål 1'!$M$6=\"\",0,'Mål 1'!$M$6)","v":{"v":0,"d":"0.0"}},{"$f":"IF(H6*G6=0,\"\",VLOOKUP(G6,Lists!B$10:G$14,CEILING(H6-0.5,1)+1,TRUE))","v":""},{"$nulls":13},{"$f":"IF(E6=0,-10,E6+AA27)","v":{"v":2.8,"d":"2.80"}},{"$f":"IF(D6=0,-10,D6+AB27)","v":{"v":1.5,"d":"1.50"}},{"$f":"IF(H6=0,W6,H6+AA27)","v":{"v":2.8,"d":"2.80"}},{"$f":"IF(G6=0,X6,G6+AB27)","v":{"v":1.5,"d":"1.50"}}]
[null,{"$f":"IF('Mål 2'!$A$4=\"\",0,'Mål 2'!$A$4)","v":{"v":0,"d":"0.00"}},"M 2",{"$f":"IF('Mål 2'!$E$6=\"\",0,'Mål 2'!$E$6)","v":0},{"$f":"IF('Mål 2'!$F$6=\"\",0,'Mål 2'!$F$6)","v":0},{"$f":"IF(E7*D7=0,\"\",VLOOKUP(D7,Lists!B$10:G$14,CEILING(E7-0.5,1)+1,TRUE))","v":""},{"$f":"IF('Mål 2'!$L$6=\"\",0,'Mål 2'!$L$6)","v":{"v":0,"d":"0.0"}},{"$f":"IF('Mål 2'!$M$6=\"\",0,'Mål 2'!$M$6)","v":{"v":0,"d":"0.0"}},{"$f":"IF(H7*G7=0,\"\",VLOOKUP(G7,Lists!B$10:G$14,CEILING(H7-0.5,1)+1,TRUE))","v":""},{"$nulls":13},{"v":-10,"d":"-10.00"},{"v":-10,"d":"-10.00"},{"v":-10,"d":"-10.00"},{"v":-10,"d":"-10.00"}]
[null,{"$f":"IF('Mål 3'!$A$4=\"\",0,'Mål 3'!$A$4)","v":{"v":0,"d":"0.00"}},"M 3",{"$f":"IF('Mål 3'!$E$6=\"\",0,'Mål 3'!$E$6)","v":0},{"$f":"IF('Mål 3'!$F$6=\"\",0,'Mål 3'!$F$6)","v":0},{"$f":"IF(E8*D8=0,\"\",VLOOKUP(D8,Lists!B$10:G$14,CEILING(E8-0.5,1)+1,TRUE))","v":""},{"$f":"IF('Mål 3'!$L$6=\"\",0,'Mål 3'!$L$6)","v":{"v":0,"d":"0.0"}},{"$f":"IF('Mål 3'!$M$6=\"\",0,'Mål 3'!$M$6)","v":{"v":0,"d":"0.0"}},{"$f":"IF(H8*G8=0,\"\",VLOOKUP(G8,Lists!B$10:G$14,CEILING(H8-0.5,1)+1,TRUE))","v":""},{"$nulls":13},{"v":-10,"d":"-10.00"},{"v":-10,"d":"-10.00"},{"v":-10,"d":"-10.00"},{"v":-10,"d":"-10.00"}]
[null,{"$f":"IF('Mål 4'!$A$4=\"\",0,'Mål 4'!$A$4)","v":{"v":0,"d":"0.00"}},"M 4",{"$f":"IF('Mål 4'!$E$6=\"\",0,'Mål 4'!$E$6)","v":0},{"$f":"IF('Mål 4'!$F$6=\"\",0,'Mål 4'!$F$6)","v":0},{"$f":"IF(E9*D9=0,\"\",VLOOKUP(D9,Lists!B$10:G$14,CEILING(E9-0.5,1)+1,TRUE))","v":""},{"$f":"IF('Mål 4'!$L$6=\"\",0,'Mål 4'!$L$6)","v":{"v":0,"d":"0.0"}},{"$f":"IF('Mål 4'!$M$6=\"\",0,'Mål 4'!$M$6)","v":{"v":0,"d":"0.0"}},{"$f":"IF(H9*G9=0,\"\",VLOOKUP(G9,Lists!B$10:G$14,CEILING(H9-0.5,1)+1,TRUE))","v":""},{"$nulls":13},{"v":-10,"d":"-10.00"},{"v":-10,"d":"-10.00"},{"v":-10,"d":"-10.00"},{"v":-10,"d":"-10.00"}]
[null,{"$f":"IF('Mål 5'!$A$4=\"\",0,'Mål 5'!$A$4)","v":{"v":0,"d":"0.00"}},"M 5",{"$f":"IF('Mål 5'!$E$6=\"\",0,'Mål 5'!$E$6)","v":0},{"$f":"IF('Mål 5'!$F$6=\"\",0,'Mål 5'!$F$6)","v":0},{"$f":"IF(E10*D10=0,\"\",VLOOKUP(D10,Lists!B$10:G$14,CEILING(E10-0.5,1)+1,TRUE))","v":""},{"$f":"IF('Mål 5'!$L$6=\"\",0,'Mål 5'!$L$6)","v":{"v":0,"d":"0.0"}},{"$f":"IF('Mål 5'!$M$6=\"\",0,'Mål 5'!$M$6)","v":{"v":0,"d":"0.0"}},{"$f":"IF(H10*G10=0,\"\",VLOOKUP(G10,Lists!B$10:G$14,CEILING(H10-0.5,1)+1,TRUE))","v":""},{"$nulls":13},{"v":-10,"d":"-10.00"},{"v":-10,"d":"-10.00"},{"v":-10,"d":"-10.00"},{"v":-10,"d":"-10.00"}]
[null,{"$f":"IF('Mål 6'!$A$4=\"\",0,'Mål 6'!$A$4)","v":{"v":0,"d":"0.00"}},"M 6",{"$f":"IF('Mål 6'!$E$6=\"\",0,'Mål 6'!$E$6)","v":0},{"$f":"IF('Mål 6'!$F$6=\"\",0,'Mål 6'!$F$6)","v":0},{"$f":"IF(E11*D11=0,\"\",VLOOKUP(D11,Lists!B$10:G$14,CEILING(E11-0.5,1)+1,TRUE))","v":""},{"$f":"IF('Mål 6'!$L$6=\"\",0,'Mål 6'!$L$6)","v":{"v":0,"d":"0.0"}},{"$f":"IF('Mål 6'!$M$6=\"\",0,'Mål 6'!$M$6)","v":{"v":0,"d":"0.0"}},{"$f":"IF(H11*G11=0,\"\",VLOOKUP(G11,Lists!B$10:G$14,CEILING(H11-0.5,1)+1,TRUE))","v":""},{"$nulls":13},{"v":-10,"d":"-10.00"},{"v":-10,"d":"-10.00"},{"v":-10,"d":"-10.00"},{"v":-10,"d":"-10.00"}]
[null,{"$f":"IF('Mål 7'!$A$4=\"\",0,'Mål 7'!$A$4)","v":{"v":0,"d":"0.00"}},"M 7",{"$f":"IF('Mål 7'!$E$6=\"\",0,'Mål 7'!$E$6)","v":0},{"$f":"IF('Mål 7'!$F$6=\"\",0,'Mål 7'!$F$6)","v":0},{"$f":"IF(E12*D12=0,\"\",VLOOKUP(D12,Lists!B$10:G$14,CEILING(E12-0.5,1)+1,TRUE))","v":""},{"$f":"IF('Mål 7'!$L$6=\"\",0,'Mål 7'!$L$6)","v":{"v":0,"d":"0.0"}},{"$f":"IF('Mål 7'!$M$6=\"\",0,'Mål 7'!$M$6)","v":{"v":0,"d":"0.0"}},{"$f":"IF(H12*G12=0,\"\",VLOOKUP(G12,Lists!B$10:G$14,CEILING(H12-0.5,1)+1,TRUE))","v":""},{"$nulls":13},{"v":-10,"d":"-10.00"},{"v":-10,"d":"-10.00"},{"v":-10,"d":"-10.00"},{"v":-10,"d":"-10.00"}]
[null,{"$f":"IF('Mål 8'!$A$4=\"\",0,'Mål 8'!$A$4)","v":{"v":0,"d":"0.00"}},"M 8",{"$f":"IF('Mål 8'!$E$6=\"\",0,'Mål 8'!$E$6)","v":0},{"$f":"IF('Mål 8'!$F$6=\"\",0,'Mål 8'!$F$6)","v":0},{"$f":"IF(E13*D13=0,\"\",VLOOKUP(D13,Lists!B$10:G$14,CEILING(E13-0.5,1)+1,TRUE))","v":""},{"$f":"IF('Mål 8'!$L$6=\"\",0,'Mål 8'!$L$6)","v":{"v":0,"d":"0.0"}},{"$f":"IF('Mål 8'!$M$6=\"\",0,'Mål 8'!$M$6)","v":{"v":0,"d":"0.0"}},{"$f":"IF(H13*G13=0,\"\",VLOOKUP(G13,Lists!B$10:G$14,CEILING(H13-0.5,1)+1,TRUE))","v":""},{"$nulls":13},{"v":-10,"d":"-10.00"},{"v":-10,"d":"-10.00"},{"v":-10,"d":"-10.00"},{"v":-10,"d":"-10.00"}]
[null,{"$f":"IF('Mål 9'!$A$4=\"\",0,'Mål 9'!$A$4)","v":{"v":0,"d":"0.00"}},"M 9",{"$f":"IF('Mål 9'!$E$6=\"\",0,'Mål 9'!$E$6)","v":0},{"$f":"IF('Mål 9'!$F$6=\"\",0,'Mål 9'!$F$6)","v":0},{"$f":"IF(E14*D14=0,\"\",VLOOKUP(D14,Lists!B$10:G$14,CEILING(E14-0.5,1)+1,TRUE))","v":""},{"$f":"IF('Mål 9'!$L$6=\"\",0,'Mål 9'!$L$6)","v":{"v":0,"d":"0.0"}},{"$f":"IF('Mål 9'!$M$6=\"\",0,'Mål 9'!$M$6)","v":{"v":0,"d":"0.0"}},{"$f":"IF(H14*G14=0,\"\",VLOOKUP(G14,Lists!B$10:G$14,CEILING(H14-0.5,1)+1,TRUE))","v":""},{"$nulls":13},{"v":-10,"d":"-10.00"},{"v":-10,"d":"-10.00"},{"v":-10,"d":"-10.00"},{"v":-10,"d":"-10.00"}]
[null,{"$f":"IF('Mål 10'!$A$4=\"\",0,'Mål 10'!$A$4)","v":{"v":0,"d":"0.00"}},"M 10",{"$f":"IF('Mål 10'!$E$6=\"\",0,'Mål 10'!$E$6)","v":0},{"$f":"IF('Mål 10'!$F$6=\"\",0,'Mål 10'!$F$6)","v":0},{"$f":"IF(E15*D15=0,\"\",VLOOKUP(D15,Lists!B$10:G$14,CEILING(E15-0.5,1)+1,TRUE))","v":""},{"$f":"IF('Mål 10'!$L$6=\"\",0,'Mål 10'!$L$6)","v":{"v":0,"d":"0.0"}},{"$f":"IF('Mål 10'!$M$6=\"\",0,'Mål 10'!$M$6)","v":{"v":0,"d":"0.0"}},{"$f":"IF(H15*G15=0,\"\",VLOOKUP(G15,Lists!B$10:G$14,CEILING(H15-0.5,1)+1,TRUE))","v":""},{"$nulls":13},{"v":-10,"d":"-10.00"},{"v":-10,"d":"-10.00"},{"v":-10,"d":"-10.00"},{"v":-10,"d":"-10.00"}]
[null,{"$f":"IF('Mål 11'!$A$4=\"\",0,'Mål 11'!$A$4)","v":{"v":0,"d":"0.00"}},"M 11",{"$f":"IF('Mål 11'!$E$6=\"\",0,'Mål 11'!$E$6)","v":0},{"$f":"IF('Mål 11'!$F$6=\"\",0,'Mål 11'!$F$6)","v":0},{"$f":"IF(E16*D16=0,\"\",VLOOKUP(D16,Lists!B$10:G$14,CEILING(E16-0.5,1)+1,TRUE))","v":""},{"$f":"IF('Mål 11'!$L$6=\"\",0,'Mål 11'!$L$6)","v":{"v":0,"d":"0.0"}},{"$f":"IF('Mål 11'!$M$6=\"\",0,'Mål 11'!$M$6)","v":{"v":0,"d":"0.0"}},{"$f":"IF(H16*G16=0,\"\",VLOOKUP(G16,Lists!B$10:G$14,CEILING(H16-0.5,1)+1,TRUE))","v":""},{"$nulls":13},{"v":-10,"d":"-10.00"},{"v":-10,"d":"-10.00"},{"v":-10,"d":"-10.00"},{"v":-10,"d":"-10.00"}]
[null,{"$f":"IF('Mål 12'!$A$4=\"\",0,'Mål 12'!$A$4)","v":{"v":0,"d":"0.00"}},"M 12",{"$f":"IF('Mål 12'!$E$6=\"\",0,'Mål 12'!$E$6)","v":0},{"$f":"IF('Mål 12'!$F$6=\"\",0,'Mål 12'!$F$6)","v":0},{"$f":"IF(E17*D17=0,\"\",VLOOKUP(D17,Lists!B$10:G$14,CEILING(E17-0.5,1)+1,TRUE))","v":""},{"$f":"IF('Mål 12'!$L$6=\"\",0,'Mål 12'!$L$6)","v":{"v":0,"d":"0.0"}},{"$f":"IF('Mål 12'!$M$6=\"\",0,'Mål 12'!$M$6)","v":{"v":0,"d":"0.0"}},{"$f":"IF(H17*G17=0,\"\",VLOOKUP(G17,Lists!B$10:G$14,CEILING(H17-0.5,1)+1,TRUE))","v":""},{"$nulls":13},{"v":-10,"d":"-10.00"},{"v":-10,"d":"-10.00"},{"v":-10,"d":"-10.00"},{"v":-10,"d":"-10.00"}]
[null,{"$f":"IF('Mål 13'!$A$4=\"\",0,'Mål 13'!$A$4)","v":{"v":0,"d":"0.00"}},"M 13",{"$f":"IF('Mål 13'!$E$6=\"\",0,'Mål 13'!$E$6)","v":0},{"$f":"IF('Mål 13'!$F$6=\"\",0,'Mål 13'!$F$6)","v":0},{"$f":"IF(E18*D18=0,\"\",VLOOKUP(D18,Lists!B$10:G$14,CEILING(E18-0.5,1)+1,TRUE))","v":""},{"$f":"IF('Mål 13'!$L$6=\"\",0,'Mål 13'!$L$6)","v":{"v":0,"d":"0.0"}},{"$f":"IF('Mål 13'!$M$6=\"\",0,'Mål 13'!$M$6)","v":{"v":0,"d":"0.0"}},{"$f":"IF(H18*G18=0,\"\",VLOOKUP(G18,Lists!B$10:G$14,CEILING(H18-0.5,1)+1,TRUE))","v":""},{"$nulls":13},{"v":-10,"d":"-10.00"},{"v":-10,"d":"-10.00"},{"v":-10,"d":"-10.00"},{"v":-10,"d":"-10.00"}]
[null,{"$f":"IF('Mål 14'!$A$4=\"\",0,'Mål 14'!$A$4)","v":{"v":0,"d":"0.00"}},"M 14",{"$f":"IF('Mål 14'!$E$6=\"\",0,'Mål 14'!$E$6)","v":0},{"$f":"IF('Mål 14'!$F$6=\"\",0,'Mål 14'!$F$6)","v":0},{"$f":"IF(E19*D19=0,\"\",VLOOKUP(D19,Lists!B$10:G$14,CEILING(E19-0.5,1)+1,TRUE))","v":""},{"$f":"IF('Mål 14'!$L$6=\"\",0,'Mål 14'!$L$6)","v":{"v":0,"d":"0.0"}},{"$f":"IF('Mål 14'!$M$6=\"\",0,'Mål 14'!$M$6)","v":{"v":0,"d":"0.0"}},{"$f":"IF(H19*G19=0,\"\",VLOOKUP(G19,Lists!B$10:G$14,CEILING(H19-0.5,1)+1,TRUE))","v":""},{"$nulls":13},{"v":-10,"d":"-10.00"},{"v":-10,"d":"-10.00"},{"v":-10,"d":"-10.00"},{"v":-10,"d":"-10.00"}]
[null,{"$f":"IF('Mål 15'!$A$4=\"\",0,'Mål 15'!$A$4)","v":{"v":0,"d":"0.00"}},"M 15",{"$f":"IF('Mål 15'!$E$6=\"\",0,'Mål 15'!$E$6)","v":0},{"$f":"IF('Mål 15'!$F$6=\"\",0,'Mål 15'!$F$6)","v":0},{"$f":"IF(E20*D20=0,\"\",VLOOKUP(D20,Lists!B$10:G$14,CEILING(E20-0.5,1)+1,TRUE))","v":""},{"$f":"IF('Mål 15'!$L$6=\"\",0,'Mål 15'!$L$6)","v":{"v":0,"d":"0.0"}},{"$f":"IF('Mål 15'!$M$6=\"\",0,'Mål 15'!$M$6)","v":{"v":0,"d":"0.0"}},{"$f":"IF(H20*G20=0,\"\",VLOOKUP(G20,Lists!B$10:G$14,CEILING(H20-0.5,1)+1,TRUE))","v":""},{"$nulls":13},{"v":-10,"d":"-10.00"},{"v":-10,"d":"-10.00"},{"v":-10,"d":"-10.00"},{"v":-10,"d":"-10.00"}]
[null,{"$f":"IF('Mål 16'!$A$4=\"\",0,'Mål 16'!$A$4)","v":{"v":0,"d":"0.00"}},"M 16",{"$f":"IF('Mål 16'!$E$6=\"\",0,'Mål 16'!$E$6)","v":0},{"$f":"IF('Mål 16'!$F$6=\"\",0,'Mål 16'!$F$6)","v":0},{"$f":"IF(E21*D21=0,\"\",VLOOKUP(D21,Lists!B$10:G$14,CEILING(E21-0.5,1)+1,TRUE))","v":""},{"$f":"IF('Mål 16'!$L$6=\"\",0,'Mål 16'!$L$6)","v":{"v":0,"d":"0.0"}},{"$f":"IF('Mål 16'!$M$6=\"\",0,'Mål 16'!$M$6)","v":{"v":0,"d":"0.0"}},{"$f":"IF(H21*G21=0,\"\",VLOOKUP(G21,Lists!B$10:G$14,CEILING(H21-0.5,1)+1,TRUE))","v":""},{"$nulls":13},{"v":-10,"d":"-10.00"},{"v":-10,"d":"-10.00"},{"v":-10,"d":"-10.00"},{"v":-10,"d":"-10.00"}]
[null,{"$f":"IF('Mål 17'!$A$4=\"\",0,'Mål 17'!$A$4)","v":{"v":0,"d":"0.00"}},"M 17",{"$f":"IF('Mål 17'!$E$6=\"\",0,'Mål 17'!$E$6)","v":0},{"$f":"IF('Mål 17'!$F$6=\"\",0,'Mål 17'!$F$6)","v":0},{"$f":"IF(E22*D22=0,\"\",VLOOKUP(D22,Lists!B$10:G$14,CEILING(E22-0.5,1)+1,TRUE))","v":""},{"$f":"IF('Mål 17'!$L$6=\"\",0,'Mål 17'!$L$6)","v":{"v":0,"d":"0.0"}},{"$f":"IF('Mål 17'!$M$6=\"\",0,'Mål 17'!$M$6)","v":{"v":0,"d":"0.0"}},{"$f":"IF(H22*G22=0,\"\",VLOOKUP(G22,Lists!B$10:G$14,CEILING(H22-0.5,1)+1,TRUE))","v":""},{"$nulls":13},{"v":-10,"d":"-10.00"},{"v":-10,"d":"-10.00"},{"v":-10,"d":"-10.00"},{"v":-10,"d":"-10.00"}]
[null,{"$f":"IF('Mål 18'!$A$4=\"\",0,'Mål 18'!$A$4)","v":{"v":0,"d":"0.00"}},"M 18",{"$f":"IF('Mål 18'!$E$6=\"\",0,'Mål 18'!$E$6)","v":0},{"$f":"IF('Mål 18'!$F$6=\"\",0,'Mål 18'!$F$6)","v":0},{"$f":"IF(E23*D23=0,\"\",VLOOKUP(D23,Lists!B$10:G$14,CEILING(E23-0.5,1)+1,TRUE))","v":""},{"$f":"IF('Mål 18'!$L$6=\"\",0,'Mål 18'!$L$6)","v":{"v":0,"d":"0.0"}},{"$f":"IF('Mål 18'!$M$6=\"\",0,'Mål 18'!$M$6)","v":{"v":0,"d":"0.0"}},{"$f":"IF(H23*G23=0,\"\",VLOOKUP(G23,Lists!B$10:G$14,CEILING(H23-0.5,1)+1,TRUE))","v":""},{"$nulls":13},{"v":-10,"d":"-10.00"},{"v":-10,"d":"-10.00"},{"v":-10,"d":"-10.00"},{"v":-10,"d":"-10.00"}]
[null,{"$f":"IF('Mål 19'!$A$4=\"\",0,'Mål 19'!$A$4)","v":{"v":0,"d":"0.00"}},"M 19",{"$f":"IF('Mål 19'!$E$6=\"\",0,'Mål 19'!$E$6)","v":0},{"$f":"IF('Mål 19'!$F$6=\"\",0,'Mål 19'!$F$6)","v":0},{"$f":"IF(E24*D24=0,\"\",VLOOKUP(D24,Lists!B$10:G$14,CEILING(E24-0.5,1)+1,TRUE))","v":""},{"$f":"IF('Mål 19'!$L$6=\"\",0,'Mål 19'!$L$6)","v":{"v":0,"d":"0.0"}},{"$f":"IF('Mål 19'!$M$6=\"\",0,'Mål 19'!$M$6)","v":{"v":0,"d":"0.0"}},{"$f":"IF(H24*G24=0,\"\",VLOOKUP(G24,Lists!B$10:G$14,CEILING(H24-0.5,1)+1,TRUE))","v":""},{"$nulls":13},{"v":-10,"d":"-10.00"},{"v":-10,"d":"-10.00"},{"v":-10,"d":"-10.00"},{"v":-10,"d":"-10.00"}]
[null,{"$f":"IF('Mål 20'!$A$4=\"\",0,'Mål 20'!$A$4)","v":{"v":0,"d":"0.00"}},"M 20",{"$f":"IF('Mål 20'!$E$6=\"\",0,'Mål 20'!$E$6)","v":0},{"$f":"IF('Mål 20'!$F$6=\"\",0,'Mål 20'!$F$6)","v":0},{"$f":"IF(E25*D25=0,\"\",VLOOKUP(D25,Lists!B$10:G$14,CEILING(E25-0.5,1)+1,TRUE))","v":""},{"$f":"IF('Mål 20'!$L$6=\"\",0,'Mål 20'!$L$6)","v":{"v":0,"d":"0.0"}},{"$f":"IF('Mål 20'!$M$6=\"\",0,'Mål 20'!$M$6)","v":{"v":0,"d":"0.0"}},{"$f":"IF(H25*G25=0,\"\",VLOOKUP(G25,Lists!B$10:G$14,CEILING(H25-0.5,1)+1,TRUE))","v":""},{"$nulls":13},{"v":-10,"d":"-10.00"},{"v":-10,"d":"-10.00"},{"v":-10,"d":"-10.00"},{"v":-10,"d":"-10.00"}]
[{"$nulls":26},"X-forskyv","Y-forskyv"]
[{"$nulls":26},-0.2,-0.5]
[{"$nulls":22},"X-Konsekvens","Y-Sannsynlighet",null,null,-0.2,-0.25]
[{"$nulls":26},-0.2,-0.2]
[{"$nulls":26},-0.4,-0.5]
[{"$nulls":21},{"$f":"C6","v":"M 1"},{"$f":"W6","v":{"v":2.8,"d":"2.80"}},{"$f":"X6","v":1.5},null,null,-0.4,-0.25]
[{"$nulls":22},{"$f":"Y6","v":{"v":2.8,"d":"2.80"}},{"$f":"Z6","v":1.5},null,null,-0.4,-0.4]
[null,null,"Målnr.","Risiko (fra kolonne c):",{"$f":"IF('Mål 1'!$I7=\"\",0,'Mål 1'!$I7)","v":"Nye tiltak:"},{"$f":"IF('Mål 1'!$J7=\"\",0,'Mål 1'!$J7)","v":"Ansvarlig:"},{"$f":"IF('Mål 1'!$K7=\"\",0,'Mål 1'!$K7)","v":"Frist:"},{"$nulls":14},{"$f":"C7","v":"M 2"},{"$f":"W7","v":-10},{"$f":"X7","v":-10},null,null,-0.6,-0.5]
[null,null,"Mål 1",{"$f":"IF('Mål 1'!$C$8=\"\",0,'Mål 1'!$C$8)","v":0},{"$f":"IF('Mål 1'!$I$8=\"\",0,'Mål 1'!$I$8)","v":0},{"$f":"IF('Mål 1'!$J$8=\"\",0,'Mål 1'!$J$8)","v":0},{"$f":"IF('Mål 1'!$K$8=\"\",0,'Mål 1'!$K$8)","v":"00:00:00"},{"$nulls":15},{"$f":"IF(Y7=-10,\"\",Y7)","v":""},{"$f":"Z7","v":-10},null,null,-0.6,-0.25]
[null,null,"Mål 1",{"$f":"IF('Mål 1'!$C$9=\"\",0,'Mål 1'!$C$9)","v":"Sekretær funksjon; utsending av sakslister og protokoll, behandle evt. forfall/innkalle vara"},{"$f":"IF('Mål 1'!#REF!=\"\",0,'Mål 1'!#REF!)","v":{"$error":"#REF!"}},{"$f":"IF('Mål 1'!$J$9=\"\",0,'Mål 1'!$J$9)","v":"Politisk sekretariat"},{"$f":"IF('Mål 1'!$K$9=\"\",0,'Mål 1'!$K$9)","v":"00:00:00"},{"$nulls":14},{"$f":"C8","v":"M 3"},{"$f":"W8","v":-10},{"$f":"X8","v":-10},null,null,-0.6,-0.4]
[null,null,"Mål 1",{"$f":"IF('Mål 1'!$C$10=\"\",0,'Mål 1'!$C$10)","v":"Sekretær i møte"},{"$f":"IF('Mål 1'!#REF!=\"\",0,'Mål 1'!#REF!)","v":{"$error":"#REF!"}},{"$f":"IF('Mål 1'!$J$10=\"\",0,'Mål 1'!$J$10)","v":"Politisk sekretariat"},{"$f":"IF('Mål 1'!$K$10=\"\",0,'Mål 1'!$K$10)","v":"00:00:00"},{"$nulls":15},{"$f":"Y8","v":-10},{"$f":"Z8","v":-10},null,null,-0.5,-0.5]
[null,null,"Mål 1",{"$f":"IF('Mål 1'!$C$11=\"\",0,'Mål 1'!$C11)","v":"Produksjon og utsendelse av sakslister og protokoll"},{"$f":"IF('Mål 1'!$I$11=\"\",0,'Mål 1'!$I11)","v":0},{"$f":"IF('Mål 1'!$J$11=\"\",0,'Mål 1'!$J11)","v":"IKT"},{"$f":"IF('Mål 1'!$K$11=\"\",0,'Mål 1'!$K11)","v":"00:00:00"},{"$nulls":14},{"$f":"C9","v":"M 4"},{"$f":"W9","v":-10},{"$f":"X9","v":-10},null,null,-0.5,-0.25]
[null,null,"Mål 1",{"$f":"IF('Mål 1'!#REF!=\"\",0,'Mål 1'!#REF!)","v":{"$error":"#REF!"}},{"$f":"IF('Mål 1'!#REF!=\"\",0,'Mål 1'!#REF!)","v":{"$error":"#REF!"}},{"$f":"IF('Mål 1'!#REF!=\"\",0,'Mål 1'!#REF!)","v":{"$error":"#REF!"}},{"$f":"IF('Mål 1'!#REF!=\"\",0,'Mål 1'!#REF!)","v":{"$error":"#REF!"}},{"$nulls":15},{"$f":"Y9","v":-10},{"$f":"Z9","v":-10},null,null,-0.5,-0.4]
[null,null,"Mål 1",{"$f":"IF('Mål 1'!#REF!=\"\",0,'Mål 1'!#REF!)","v":{"$error":"#REF!"}},{"$f":"IF('Mål 1'!#REF!=\"\",0,'Mål 1'!#REF!)","v":{"$error":"#REF!"}},{"$f":"IF('Mål 1'!#REF!=\"\",0,'Mål 1'!#REF!)","v":{"$error":"#REF!"}},{"$f":"IF('Mål 1'!#REF!=\"\",0,'Mål 1'!#REF!)","v":{"$error":"#REF!"}},{"$nulls":14},{"$f":"C10","v":"M 5"},{"$f":"W10","v":-10},{"$f":"X10","v":-10},null,null,-0.33,-0.5]
[null,null,"Mål 1",{"$f":"IF('Mål 1'!#REF!=\"\",0,'Mål 1'!#REF!)","v":{"$error":"#REF!"}},{"$f":"IF('Mål 1'!#REF!=\"\",0,'Mål 1'!#REF!)","v":{"$error":"#REF!"}},{"$f":"IF('Mål 1'!#REF!=\"\",0,'Mål 1'!#REF!)","v":{"$error":"#REF!"}},{"$f":"IF('Mål 1'!#REF!=\"\",0,'Mål 1'!#REF!)","v":{"$error":"#REF!"}},{"$nulls":15},{"$f":"Y10","v":-10},{"$f":"Z10","v":-10},null,null,-0.33,-0.25]
[null,null,"Mål 1",{"$f":"IF('Mål 1'!#REF!=\"\",0,'Mål 1'!#REF!)","v":{"$error":"#REF!"}},{"$f":"IF('Mål 1'!#REF!=\"\",0,'Mål 1'!#REF!)","v":{"$error":"#REF!"}},{"$f":"IF('Mål 1'!#REF!=\"\",0,'Mål 1'!#REF!)","v":{"$error":"#REF!"}},{"$f":"IF('Mål 1'!#REF!=\"\",0,'Mål 1'!#REF!)","v":{"$error":"#REF!"}},{"$nulls":14},{"$f":"C11","v":"M 6"},{"$f":"W11","v":-10},{"$f":"X11","v":-10},null,null,-0.33,-0.4]
[null,null,"Mål 1",{"$f":"IF('Mål 1'!#REF!=\"\",0,'Mål 1'!#REF!)","v":{"$error":"#REF!"}},{"$f":"IF('Mål 1'!#REF!=\"\",0,'Mål 1'!#REF!)","v":{"$error":"#REF!"}},{"$f":"IF('Mål 1'!#REF!=\"\",0,'Mål 1'!#REF!)","v":{"$error":"#REF!"}},{"$f":"IF('Mål 1'!#REF!=\"\",0,'Mål 1'!#REF!)","v":{"$error":"#REF!"}},{"$nulls":15},{"$f":"Y11","v":-10},{"$f":"Z11","v":-10},null,null,-0.25,-0.5]
[null,null,"Mål 1",{"$f":"IF('Mål 1'!#REF!=\"\",0,'Mål 1'!#REF!)","v":{"$error":"#REF!"}},{"$f":"IF('Mål 1'!#REF!=\"\",0,'Mål 1'!#REF!)","v":{"$error":"#REF!"}},{"$f":"IF('Mål 1'!#REF!=\"\",0,'Mål 1'!#REF!)","v":{"$error":"#REF!"}},{"$f":"IF('Mål 1'!#REF!=\"\",0,'Mål 1'!#REF!)","v":{"$error":"#REF!"}},{"$nulls":14},{"$f":"C12","v":"M 7"},{"$f":"W12","v":-10},{"$f":"X12","v":-10},null,null,-0.25,-0.25]
[null,null,"Mål 1",{"$f":"IF('Mål 1'!#REF!=\"\",0,'Mål 1'!#REF!)","v":{"$error":"#REF!"}},{"$f":"IF('Mål 1'!#REF!=\"\",0,'Mål 1'!#REF!)","v":{"$error":"#REF!"}},{"$f":"IF('Mål 1'!#REF!=\"\",0,'Mål 1'!#REF!)","v":{"$error":"#REF!"}},{"$f":"IF('Mål 1'!#REF!=\"\",0,'Mål 1'!#REF!)","v":{"$error":"#REF!"}},{"$nulls":15},{"$f":"Y12","v":-10},{"$f":"Z12","v":-10},null,null,-0.25,-0.4]
[null,null,"Mål 1",{"$f":"IF('Mål 1'!$C$12=\"\",0,'Mål 1'!$C$12)","v":"Produksjon og utsendelse av sakslister og protokoll"},{"$f":"IF('Mål 1'!$I$12=\"\",0,'Mål 1'!$I$12)","v":0},{"$f":"IF('Mål 1'!$J$12=\"\",0,'Mål 1'!$J$12)","v":0},{"$f":"IF('Mål 1'!$K$12=\"\",0,'Mål 1'!$K$12)","v":"00:00:00"},{"$nulls":14},{"$f":"C13","v":"M 8"},{"$f":"W13","v":-10},{"$f":"X13","v":-10},null,null,-0.15,-0.5]
[null,null,"Mål 1",{"$f":"IF('Mål 1'!#REF!=\"\",0,'Mål 1'!#REF!)","v":{"$error":"#REF!"}},{"$f":"IF('Mål 1'!#REF!=\"\",0,'Mål 1'!#REF!)","v":{"$error":"#REF!"}},{"$f":"IF('Mål 1'!#REF!=\"\",0,'Mål 1'!#REF!)","v":{"$error":"#REF!"}},{"$f":"IF('Mål 1'!#REF!=\"\",0,'Mål 1'!#REF!)","v":{"$error":"#REF!"}},{"$nulls":15},{"$f":"Y13","v":-10},{"$f":"Z13","v":-10},null,null,-0.15,-0.25]
[null,null,"Mål 1",{"$f":"IF('Mål 1'!#REF!=\"\",0,'Mål 1'!#REF!)","v":{"$error":"#REF!"}},{"$f":"IF('Mål 1'!#REF!=\"\",0,'Mål 1'!#REF!)","v":{"$error":"#REF!"}},{"$f":"IF('Mål 1'!#REF!=\"\",0,'Mål 1'!#REF!)","v":{"$error":"#REF!"}},{"$f":"IF('Mål 1'!#REF!=\"\",0,'Mål 1'!#REF!)","v":{"$error":"#REF!"}},{"$nulls":14},{"$f":"C14","v":"M 9"},{"$f":"W14","v":-10},{"$f":"X14","v":-10}]
[null,null,"Mål 1",{"$f":"IF('Mål 1'!#REF!=\"\",0,'Mål 1'!#REF!)","v":{"$error":"#REF!"}},{"$f":"IF('Mål 1'!#REF!=\"\",0,'Mål 1'!#REF!)","v":{"$error":"#REF!"}},{"$f":"IF('Mål 1'!#REF!=\"\",0,'Mål 1'!#REF!)","v":{"$error":"#REF!"}},{"$f":"IF('Mål 1'!#REF!=\"\",0,'Mål 1'!#REF!)","v":{"$error":"#REF!"}},{"$nulls":15},{"$f":"Y14","v":-10},{"$f":"Z14","v":-10}]
[null,null,"Mål 1",{"$f":"IF('Mål 1'!#REF!=\"\",0,'Mål 1'!#REF!)","v":{"$error":"#REF!"}},{"$f":"IF('Mål 1'!#REF!=\"\",0,'Mål 1'!#REF!)","v":{"$error":"#REF!"}},{"$f":"IF('Mål 1'!#REF!=\"\",0,'Mål 1'!#REF!)","v":{"$error":"#REF!"}},{"$f":"IF('Mål 1'!#REF!=\"\",0,'Mål 1'!#REF!)","v":{"$error":"#REF!"}},{"$nulls":14},{"$f":"C15","v":"M 10"},{"$f":"W15","v":-10},{"$f":"X15","v":-10}]
[null,null,"Mål 1",{"$f":"IF('Mål 1'!#REF!=\"\",0,'Mål 1'!#REF!)","v":{"$error":"#REF!"}},{"$f":"IF('Mål 1'!#REF!=\"\",0,'Mål 1'!#REF!)","v":{"$error":"#REF!"}},{"$f":"IF('Mål 1'!#REF!=\"\",0,'Mål 1'!#REF!)","v":{"$error":"#REF!"}},{"$f":"IF('Mål 1'!#REF!=\"\",0,'Mål 1'!#REF!)","v":{"$error":"#REF!"}},{"$nulls":15},{"$f":"Y15","v":-10},{"$f":"Z15","v":-10}]
[null,null,"Mål 1",{"$f":"IF('Mål 1'!$C$13=\"\",0,'Mål 1'!$C$13)","v":"Produksjon og utsendelse av sakslister og protokoller"},{"$f":"IF('Mål 1'!$I$13=\"\",0,'Mål 1'!$I$13)","v":"Utsendelse av sakslister og protokoller på papir (dersom vi har tilgang til skrivere) og på mail. "},{"$f":"IF('Mål 1'!$J$13=\"\",0,'Mål 1'!$J$13)","v":"Politisk sekretariat"},{"$f":"IF('Mål 1'!$K$13=\"\",0,'Mål 1'!$K$13)","v":"00:00:00"},{"$nulls":14},{"$f":"C16","v":"M 11"},{"$f":"W16","v":-10},{"$f":"X16","v":-10}]
[null,null,"Mål 1",{"$f":"IF('Mål 1'!$C$14=\"\",0,'Mål 1'!$C$14)","v":"Produksjon og utsendelse av sakslister og protokoller"},{"$f":"IF('Mål 1'!$I$14=\"\",0,'Mål 1'!$I$14)","v":"Avkare rutiner med kommunedirektør. Utsendelse av tilleggssaksliste evt. utsette sak til neste møte"},{"$f":"IF('Mål 1'!$J$14=\"\",0,'Mål 1'!$J$14)","v":"Politisk sekretariat"},{"$f":"IF('Mål 1'!$K$14=\"\",0,'Mål 1'!$K$14)","v":"00:00:00"},{"$nulls":15},{"$f":"Y16","v":-10},{"$f":"Z16","v":-10}]
[null,null,"Mål 1",{"$f":"IF('Mål 1'!$C$15=\"\",0,'Mål 1'!$C$15)","v":"Produksjon og utsendelse av sakslister"},{"$f":"IF('Mål 1'!$I$15=\"\",0,'Mål 1'!$I$15)","v":0},{"$f":"IF('Mål 1'!$J$15=\"\",0,'Mål 1'!$J$15)","v":"Kommunedirektøren"},{"$f":"IF('Mål 1'!$K$15=\"\",0,'Mål 1'!$K$15)","v":"00:00:00"},{"$nulls":14},{"$f":"C17","v":"M 12"},{"$f":"W17","v":{"v":-10,"d":"-10.00"}},{"$f":"X17","v":-10}]
[null,null,"Mål 2",{"$f":"IF('Mål 2'!$C$8=\"\",0,'Mål 2'!$C$8)","v":0},{"$f":"IF('Mål 2'!$I$8=\"\",0,'Mål 2'!$I$8)","v":0},{"$f":"IF('Mål 2'!$J$8=\"\",0,'Mål 2'!$J$8)","v":0},{"$f":"IF('Mål 2'!$K$8=\"\",0,'Mål 2'!$K$8)","v":"00:00:00"},{"$nulls":15},{"$f":"Y17","v":-10},{"$f":"Z17","v":-10}]
[null,null,"Mål 2",{"$f":"IF('Mål 2'!$C$9=\"\",0,'Mål 2'!$C$9)","v":0},{"$f":"IF('Mål 2'!$I$9=\"\",0,'Mål 2'!$I$9)","v":0},{"$f":"IF('Mål 2'!$J$9=\"\",0,'Mål 2'!$J$9)","v":0},{"$f":"IF('Mål 2'!$K$9=\"\",0,'Mål 2'!$K$9)","v":"00:00:00"},{"$nulls":14},{"$f":"C18","v":"M 13"},{"$f":"W18","v":-10},{"$f":"X18","v":-10}]
[null,null,"Mål 2",{"$f":"IF('Mål 2'!$C$10=\"\",0,'Mål 2'!$C$10)","v":0},{"$f":"IF('Mål 2'!$I$10=\"\",0,'Mål 2'!$I$10)","v":0},{"$f":"IF('Mål 2'!$J$10=\"\",0,'Mål 2'!$J$10)","v":0},{"$f":"IF('Mål 2'!$K$10=\"\",0,'Mål 2'!$K$10)","v":"00:00:00"},{"$nulls":15},{"$f":"Y18","v":-10},{"$f":"Z18","v":-10}]
[null,null,"Mål 2",{"$f":"IF('Mål 2'!$C$11=\"\",0,'Mål 2'!$C31)","v":0},{"$f":"IF('Mål 2'!$I$11=\"\",0,'Mål 2'!$I31)","v":0},{"$f":"IF('Mål 2'!$J$11=\"\",0,'Mål 2'!$J31)","v":0},{"$f":"IF('Mål 2'!$K$11=\"\",0,'Mål 2'!$K31)","v":"00:00:00"},{"$nulls":14},{"$f":"C19","v":"M 14"},{"$f":"W19","v":-10},{"$f":"X19","v":-10}]
[null,null,"Mål 2",{"$f":"IF('Mål 2'!$C$12=\"\",0,'Mål 2'!$C$12)","v":0},{"$f":"IF('Mål 2'!$I$12=\"\",0,'Mål 2'!$I$12)","v":0},{"$f":"IF('Mål 2'!$J$12=\"\",0,'Mål 2'!$J$12)","v":0},{"$f":"IF('Mål 2'!$K$12=\"\",0,'Mål 2'!$K$12)","v":"00:00:00"},{"$nulls":15},{"$f":"Y19","v":-10},{"$f":"Z19","v":-10}]
[null,null,"Mål 2",{"$f":"IF('Mål 2'!$C$13=\"\",0,'Mål 2'!$C$13)","v":0},{"$f":"IF('Mål 2'!$I$13=\"\",0,'Mål 2'!$I$13)","v":0},{"$f":"IF('Mål 2'!$J$13=\"\",0,'Mål 2'!$J$13)","v":0},{"$f":"IF('Mål 2'!$K$13=\"\",0,'Mål 2'!$K$13)","v":"00:00:00"},{"$nulls":14},{"$f":"C20","v":"M 15"},{"$f":"W20","v":-10},{"$f":"X20","v":-10}]
[null,null,"Mål 2",{"$f":"IF('Mål 2'!$C$14=\"\",0,'Mål 2'!$C$14)","v":0},{"$f":"IF('Mål 2'!$I$14=\"\",0,'Mål 2'!$I$14)","v":0},{"$f":"IF('Mål 2'!$J$14=\"\",0,'Mål 2'!$J$14)","v":0},{"$f":"IF('Mål 2'!$K$14=\"\",0,'Mål 2'!$K$14)","v":"00:00:00"},{"$nulls":15},{"$f":"Y20","v":-10},{"$f":"Z20","v":-10}]
[null,null,"Mål 2",{"$f":"IF('Mål 2'!$C$15=\"\",0,'Mål 2'!$C$15)","v":0},{"$f":"IF('Mål 2'!$I$15=\"\",0,'Mål 2'!$I$15)","v":0},{"$f":"IF('Mål 2'!$J$15=\"\",0,'Mål 2'!$J$15)","v":0},{"$f":"IF('Mål 2'!$K$15=\"\",0,'Mål 2'!$K$15)","v":"00:00:00"},{"$nulls":14},{"$f":"C21","v":"M 16"},{"$f":"W21","v":{"v":-10,"d":"-10.00"}},{"$f":"X21","v":{"v":-10,"d":"-10.00"}}]
[null,null,"Mål 2",{"$f":"IF('Mål 2'!$C$16=\"\",0,'Mål 2'!$C$16)","v":0},{"$f":"IF('Mål 2'!$I$16=\"\",0,'Mål 2'!$I$16)","v":0},{"$f":"IF('Mål 2'!$J$16=\"\",0,'Mål 2'!$J$16)","v":0},{"$f":"IF('Mål 2'!$K$16=\"\",0,'Mål 2'!$K$16)","v":"00:00:00"},{"$nulls":15},{"$f":"Y21","v":{"v":-10,"d":"-10.00"}},{"$f":"Z21","v":{"v":-10,"d":"-10.00"}}]
[null,null,"Mål 2",{"$f":"IF('Mål 2'!$C$17=\"\",0,'Mål 2'!$C$17)","v":0},{"$f":"IF('Mål 2'!$I$17=\"\",0,'Mål 2'!$I$17)","v":0},{"$f":"IF('Mål 2'!$J$17=\"\",0,'Mål 2'!$J$17)","v":0},{"$f":"IF('Mål 2'!$K$17=\"\",0,'Mål 2'!$K$17)","v":"00:00:00"},{"$nulls":14},{"$f":"C22","v":"M 17"},{"$f":"W22","v":{"v":-10,"d":"-10.00"}},{"$f":"X22","v":{"v":-10,"d":"-10.00"}}]
[null,null,"Mål 2",{"$f":"IF('Mål 2'!$C$18=\"\",0,'Mål 2'!$C$18)","v":0},{"$f":"IF('Mål 2'!$I$18=\"\",0,'Mål 2'!$I$18)","v":0},{"$f":"IF('Mål 2'!$J$18=\"\",0,'Mål 2'!$J$18)","v":0},{"$f":"IF('Mål 2'!$K$18=\"\",0,'Mål 2'!$K$18)","v":"00:00:00"},{"$nulls":15},{"$f":"Y22","v":{"v":-10,"d":"-10.00"}},{"$f":"Z22","v":{"v":-10,"d":"-10.00"}}]
[null,null,"Mål 2",{"$f":"IF('Mål 2'!$C$19=\"\",0,'Mål 2'!$C$19)","v":0},{"$f":"IF('Mål 2'!$I$19=\"\",0,'Mål 2'!$I$19)","v":0},{"$f":"IF('Mål 2'!$J$19=\"\",0,'Mål 2'!$J$19)","v":0},{"$f":"IF('Mål 2'!$K$19=\"\",0,'Mål 2'!$K$19)","v":"00:00:00"},{"$nulls":14},{"$f":"C23","v":"M 18"},{"$f":"W23","v":{"v":-10,"d":"-10.00"}},{"$f":"X23","v":{"v":-10,"d":"-10.00"}}]
[null,null,"Mål 2",{"$f":"IF('Mål 2'!$C$20=\"\",0,'Mål 2'!$C$20)","v":0},{"$f":"IF('Mål 2'!$I$20=\"\",0,'Mål 2'!$I$20)","v":0},{"$f":"IF('Mål 2'!$J$20=\"\",0,'Mål 2'!$J$20)","v":0},{"$f":"IF('Mål 2'!$K$20=\"\",0,'Mål 2'!$K$20)","v":"00:00:00"},{"$nulls":15},{"$f":"Y23","v":{"v":-10,"d":"-10.00"}},{"$f":"Z23","v":{"v":-10,"d":"-10.00"}}]
[null,null,"Mål 2",{"$f":"IF('Mål 2'!$C$21=\"\",0,'Mål 2'!$C$21)","v":0},{"$f":"IF('Mål 2'!$I$21=\"\",0,'Mål 2'!$I$21)","v":0},{"$f":"IF('Mål 2'!$J$21=\"\",0,'Mål 2'!$J$21)","v":0},{"$f":"IF('Mål 2'!$K$21=\"\",0,'Mål 2'!$K$21)","v":"00:00:00"},{"$nulls":14},{"$f":"C24","v":"M 19"},{"$f":"W24","v":{"v":-10,"d":"-10.00"}},{"$f":"X24","v":{"v":-10,"d":"-10.00"}}]
[null,null,"Mål 2",{"$f":"IF('Mål 2'!$C$22=\"\",0,'Mål 2'!$C$22)","v":0},{"$f":"IF('Mål 2'!$I$22=\"\",0,'Mål 2'!$I$22)","v":0},{"$f":"IF('Mål 2'!$J$22=\"\",0,'Mål 2'!$J$22)","v":0},{"$f":"IF('Mål 2'!$K$22=\"\",0,'Mål 2'!$K$22)","v":"00:00:00"},{"$nulls":15},{"$f":"Y24","v":{"v":-10,"d":"-10.00"}},{"$f":"Z24","v":{"v":-10,"d":"-10.00"}}]
[null,null,"Mål 2",{"$f":"IF('Mål 2'!$C$23=\"\",0,'Mål 2'!$C$23)","v":0},{"$f":"IF('Mål 2'!$I$23=\"\",0,'Mål 2'!$I$23)","v":0},{"$f":"IF('Mål 2'!$J$23=\"\",0,'Mål 2'!$J$23)","v":0},{"$f":"IF('Mål 2'!$K$23=\"\",0,'Mål 2'!$K$23)","v":"00:00:00"},{"$nulls":14},{"$f":"C25","v":"M 20"},{"$f":"W25","v":{"v":-10,"d":"-10.00"}},{"$f":"X25","v":{"v":-10,"d":"-10.00"}}]
[null,null,"Mål 2",{"$f":"IF('Mål 2'!$C$24=\"\",0,'Mål 2'!$C$24)","v":0},{"$f":"IF('Mål 2'!$I$24=\"\",0,'Mål 2'!$I$24)","v":0},{"$f":"IF('Mål 2'!$J$24=\"\",0,'Mål 2'!$J$24)","v":0},{"$f":"IF('Mål 2'!$K$24=\"\",0,'Mål 2'!$K$24)","v":"00:00:00"},{"$nulls":15},{"$f":"Y25","v":{"v":-10,"d":"-10.00"}},{"$f":"Z25","v":{"v":-10,"d":"-10.00"}}]
[null,null,"Mål 2",{"$f":"IF('Mål 2'!$C$25=\"\",0,'Mål 2'!$C$25)","v":0},{"$f":"IF('Mål 2'!$I$25=\"\",0,'Mål 2'!$I$25)","v":0},{"$f":"IF('Mål 2'!$J$25=\"\",0,'Mål 2'!$J$25)","v":0},{"$f":"IF('Mål 2'!$K$25=\"\",0,'Mål 2'!$K$25)","v":"00:00:00"}]
[null,null,"Mål 2",{"$f":"IF('Mål 2'!$C$26=\"\",0,'Mål 2'!$C$26)","v":0},{"$f":"IF('Mål 2'!$I$26=\"\",0,'Mål 2'!$I$26)","v":0},{"$f":"IF('Mål 2'!$J$26=\"\",0,'Mål 2'!$J$26)","v":0},{"$f":"IF('Mål 2'!$K$26=\"\",0,'Mål 2'!$K$26)","v":"00:00:00"}]
[null,null,"Mål 2",{"$f":"IF('Mål 2'!$C$27=\"\",0,'Mål 2'!$C$27)","v":0},{"$f":"IF('Mål 2'!$I$27=\"\",0,'Mål 2'!$I$27)","v":0},{"$f":"IF('Mål 2'!$J$27=\"\",0,'Mål 2'!$J$27)","v":0},{"$f":"IF('Mål 2'!$K$27=\"\",0,'Mål 2'!$K$27)","v":"00:00:00"}]
[null,null,"Mål 3",{"$f":"IF('Mål 3'!$C$8=\"\",0,'Mål 3'!$C$8)","v":0},{"$f":"IF('Mål 3'!$I$8=\"\",0,'Mål 3'!$I$8)","v":0},{"$f":"IF('Mål 3'!$J$8=\"\",0,'Mål 3'!$J$8)","v":0},{"$f":"IF('Mål 3'!$K$8=\"\",0,'Mål 3'!$K$8)","v":"00:00:00"}]
[null,null,"Mål 3",{"$f":"IF('Mål 3'!$C$9=\"\",0,'Mål 3'!$C$9)","v":0},{"$f":"IF('Mål 3'!$I$9=\"\",0,'Mål 3'!$I$9)","v":0},{"$f":"IF('Mål 3'!$J$9=\"\",0,'Mål 3'!$J$9)","v":0},{"$f":"IF('Mål 3'!$K$9=\"\",0,'Mål 3'!$K$9)","v":"00:00:00"}]
[null,null,"Mål 3",{"$f":"IF('Mål 3'!$C$10=\"\",0,'Mål 3'!$C$10)","v":0},{"$f":"IF('Mål 3'!$I$10=\"\",0,'Mål 3'!$I$10)","v":0},{"$f":"IF('Mål 3'!$J$10=\"\",0,'Mål 3'!$J$10)","v":0},{"$f":"IF('Mål 3'!$K$10=\"\",0,'Mål 3'!$K$10)","v":"00:00:00"}]
[null,null,"Mål 3",{"$f":"IF('Mål 3'!$C$11=\"\",0,'Mål 3'!$C51)","v":0},{"$f":"IF('Mål 3'!$I$11=\"\",0,'Mål 3'!$I51)","v":0},{"$f":"IF('Mål 3'!$J$11=\"\",0,'Mål 3'!$J51)","v":0},{"$f":"IF('Mål 3'!$K$11=\"\",0,'Mål 3'!$K51)","v":"00:00:00"}]
[null,null,"Mål 3",{"$f":"IF('Mål 3'!$C$12=\"\",0,'Mål 3'!$C$12)","v":0},{"$f":"IF('Mål 3'!$I$12=\"\",0,'Mål 3'!$I$12)","v":0},{"$f":"IF('Mål 3'!$J$12=\"\",0,'Mål 3'!$J$12)","v":0},{"$f":"IF('Mål 3'!$K$12=\"\",0,'Mål 3'!$K$12)","v":"00:00:00"}]
[null,null,"Mål 3",{"$f":"IF('Mål 3'!$C$13=\"\",0,'Mål 3'!$C$13)","v":0},{"$f":"IF('Mål 3'!$I$13=\"\",0,'Mål 3'!$I$13)","v":0},{"$f":"IF('Mål 3'!$J$13=\"\",0,'Mål 3'!$J$13)","v":0},{"$f":"IF('Mål 3'!$K$13=\"\",0,'Mål 3'!$K$13)","v":"00:00:00"}]
[null,null,"Mål 3",{"$f":"IF('Mål 3'!$C$14=\"\",0,'Mål 3'!$C$14)","v":0},{"$f":"IF('Mål 3'!$I$14=\"\",0,'Mål 3'!$I$14)","v":0},{"$f":"IF('Mål 3'!$J$14=\"\",0,'Mål 3'!$J$14)","v":0},{"$f":"IF('Mål 3'!$K$14=\"\",0,'Mål 3'!$K$14)","v":"00:00:00"}]
[null,null,"Mål 3",{"$f":"IF('Mål 3'!$C$15=\"\",0,'Mål 3'!$C$15)","v":0},{"$f":"IF('Mål 3'!$I$15=\"\",0,'Mål 3'!$I$15)","v":0},{"$f":"IF('Mål 3'!$J$15=\"\",0,'Mål 3'!$J$15)","v":0},{"$f":"IF('Mål 3'!$K$15=\"\",0,'Mål 3'!$K$15)","v":"00:00:00"}]
[null,null,"Mål 3",{"$f":"IF('Mål 3'!$C$16=\"\",0,'Mål 3'!$C$16)","v":0},{"$f":"IF('Mål 3'!$I$16=\"\",0,'Mål 3'!$I$16)","v":0},{"$f":"IF('Mål 3'!$J$16=\"\",0,'Mål 3'!$J$16)","v":0},{"$f":"IF('Mål 3'!$K$16=\"\",0,'Mål 3'!$K$16)","v":"00:00:00"}]
[null,null,"Mål 3",{"$f":"IF('Mål 3'!$C$17=\"\",0,'Mål 3'!$C$17)","v":0},{"$f":"IF('Mål 3'!$I$17=\"\",0,'Mål 3'!$I$17)","v":0},{"$f":"IF('Mål 3'!$J$17=\"\",0,'Mål 3'!$J$17)","v":0},{"$f":"IF('Mål 3'!$K$17=\"\",0,'Mål 3'!$K$17)","v":"00:00:00"}]
[null,null,"Mål 3",{"$f":"IF('Mål 3'!$C$18=\"\",0,'Mål 3'!$C$18)","v":0},{"$f":"IF('Mål 3'!$I$18=\"\",0,'Mål 3'!$I$18)","v":0},{"$f":"IF('Mål 3'!$J$18=\"\",0,'Mål 3'!$J$18)","v":0},{"$f":"IF('Mål 3'!$K$18=\"\",0,'Mål 3'!$K$18)","v":"00:00:00"}]
[null,null,"Mål 3",{"$f":"IF('Mål 3'!$C$19=\"\",0,'Mål 3'!$C$19)","v":0},{"$f":"IF('Mål 3'!$I$19=\"\",0,'Mål 3'!$I$19)","v":0},{"$f":"IF('Mål 3'!$J$19=\"\",0,'Mål 3'!$J$19)","v":0},{"$f":"IF('Mål 3'!$K$19=\"\",0,'Mål 3'!$K$19)","v":"00:00:00"}]
[null,null,"Mål 3",{"$f":"IF('Mål 3'!$C$20=\"\",0,'Mål 3'!$C$20)","v":0},{"$f":"IF('Mål 3'!$I$20=\"\",0,'Mål 3'!$I$20)","v":0},{"$f":"IF('Mål 3'!$J$20=\"\",0,'Mål 3'!$J$20)","v":0},{"$f":"IF('Mål 3'!$K$20=\"\",0,'Mål 3'!$K$20)","v":"00:00:00"}]
[null,null,"Mål 3",{"$f":"IF('Mål 3'!$C$21=\"\",0,'Mål 3'!$C$21)","v":0},{"$f":"IF('Mål 3'!$I$21=\"\",0,'Mål 3'!$I$21)","v":0},{"$f":"IF('Mål 3'!$J$21=\"\",0,'Mål 3'!$J$21)","v":0},{"$f":"IF('Mål 3'!$K$21=\"\",0,'Mål 3'!$K$21)","v":"00:00:00"}]
[null,null,"Mål 3",{"$f":"IF('Mål 3'!$C$22=\"\",0,'Mål 3'!$C$22)","v":0},{"$f":"IF('Mål 3'!$I$22=\"\",0,'Mål 3'!$I$22)","v":0},{"$f":"IF('Mål 3'!$J$22=\"\",0,'Mål 3'!$J$22)","v":0},{"$f":"IF('Mål 3'!$K$22=\"\",0,'Mål 3'!$K$22)","v":"00:00:00"}]
[null,null,"Mål 3",{"$f":"IF('Mål 3'!$C$23=\"\",0,'Mål 3'!$C$23)","v":0},{"$f":"IF('Mål 3'!$I$23=\"\",0,'Mål 3'!$I$23)","v":0},{"$f":"IF('Mål 3'!$J$23=\"\",0,'Mål 3'!$J$23)","v":0},{"$f":"IF('Mål 3'!$K$23=\"\",0,'Mål 3'!$K$23)","v":"00:00:00"}]
[null,null,"Mål 3",{"$f":"IF('Mål 3'!$C$24=\"\",0,'Mål 3'!$C$24)","v":0},{"$f":"IF('Mål 3'!$I$24=\"\",0,'Mål 3'!$I$24)","v":0},{"$f":"IF('Mål 3'!$J$24=\"\",0,'Mål 3'!$J$24)","v":0},{"$f":"IF('Mål 3'!$K$24=\"\",0,'Mål 3'!$K$24)","v":"00:00:00"}]
[null,null,"Mål 3",{"$f":"IF('Mål 3'!$C$25=\"\",0,'Mål 3'!$C$25)","v":0},{"$f":"IF('Mål 3'!$I$25=\"\",0,'Mål 3'!$I$25)","v":0},{"$f":"IF('Mål 3'!$J$25=\"\",0,'Mål 3'!$J$25)","v":0},{"$f":"IF('Mål 3'!$K$25=\"\",0,'Mål 3'!$K$25)","v":"00:00:00"}]
[null,null,"Mål 3",{"$f":"IF('Mål 3'!$C$26=\"\",0,'Mål 3'!$C$26)","v":0},{"$f":"IF('Mål 3'!$I$26=\"\",0,'Mål 3'!$I$26)","v":0},{"$f":"IF('Mål 3'!$J$26=\"\",0,'Mål 3'!$J$26)","v":0},{"$f":"IF('Mål 3'!$K$26=\"\",0,'Mål 3'!$K$26)","v":"00:00:00"}]
[null,null,"Mål 3",{"$f":"IF('Mål 3'!$C$27=\"\",0,'Mål 3'!$C$27)","v":0},{"$f":"IF('Mål 3'!$I$27=\"\",0,'Mål 3'!$I$27)","v":0},{"$f":"IF('Mål 3'!$J$27=\"\",0,'Mål 3'!$J$27)","v":0},{"$f":"IF('Mål 3'!$K$27=\"\",0,'Mål 3'!$K$27)","v":"00:00:00"}]
[null,null,"Mål 4",{"$f":"IF('Mål 4'!#REF!=\"\",0,'Mål 4'!#REF!)","v":{"$error":"#REF!"}},{"$f":"IF('Mål 4'!$I$8=\"\",0,'Mål 4'!$I$8)","v":0},{"$f":"IF('Mål 4'!$J$8=\"\",0,'Mål 4'!$J$8)","v":0},{"$f":"IF('Mål 4'!$K$8=\"\",0,'Mål 4'!$K$8)","v":"00:00:00"}]
[null,null,"Mål 4",{"$f":"IF('Mål 4'!#REF!=\"\",0,'Mål 4'!#REF!)","v":{"$error":"#REF!"}},{"$f":"IF('Mål 4'!$I$9=\"\",0,'Mål 4'!$I$9)","v":0},{"$f":"IF('Mål 4'!$J$9=\"\",0,'Mål 4'!$J$9)","v":0},{"$f":"IF('Mål 4'!$K$9=\"\",0,'Mål 4'!$K$9)","v":"00:00:00"}]
[null,null,"Mål 4",{"$f":"IF('Mål 4'!$C$10=\"\",0,'Mål 4'!$C$10)","v":0},{"$f":"IF('Mål 4'!$I$10=\"\",0,'Mål 4'!$I$10)","v":0},{"$f":"IF('Mål 4'!$J$10=\"\",0,'Mål 4'!$J$10)","v":0},{"$f":"IF('Mål 4'!$K$10=\"\",0,'Mål 4'!$K$10)","v":"00:00:00"}]
[null,null,"Mål 4",{"$f":"IF('Mål 4'!$C$11=\"\",0,'Mål 4'!$C71)","v":0},{"$f":"IF('Mål 4'!$I$11=\"\",0,'Mål 4'!$I71)","v":0},{"$f":"IF('Mål 4'!$J$11=\"\",0,'Mål 4'!$J71)","v":0},{"$f":"IF('Mål 4'!$K$11=\"\",0,'Mål 4'!$K71)","v":"00:00:00"}]
[null,null,"Mål 4",{"$f":"IF('Mål 4'!$C$12=\"\",0,'Mål 4'!$C$12)","v":0},{"$f":"IF('Mål 4'!$I$12=\"\",0,'Mål 4'!$I$12)","v":0},{"$f":"IF('Mål 4'!$J$12=\"\",0,'Mål 4'!$J$12)","v":0},{"$f":"IF('Mål 4'!$K$12=\"\",0,'Mål 4'!$K$12)","v":"00:00:00"}]
[null,null,"Mål 4",{"$f":"IF('Mål 4'!$C$13=\"\",0,'Mål 4'!$C$13)","v":0},{"$f":"IF('Mål 4'!$I$13=\"\",0,'Mål 4'!$I$13)","v":0},{"$f":"IF('Mål 4'!$J$13=\"\",0,'Mål 4'!$J$13)","v":0},{"$f":"IF('Mål 4'!$K$13=\"\",0,'Mål 4'!$K$13)","v":"00:00:00"}]
[null,null,"Mål 4",{"$f":"IF('Mål 4'!$C$14=\"\",0,'Mål 4'!$C$14)","v":0},{"$f":"IF('Mål 4'!$I$14=\"\",0,'Mål 4'!$I$14)","v":0},{"$f":"IF('Mål 4'!$J$14=\"\",0,'Mål 4'!$J$14)","v":0},{"$f":"IF('Mål 4'!$K$14=\"\",0,'Mål 4'!$K$14)","v":"00:00:00"}]
[null,null,"Mål 4",{"$f":"IF('Mål 4'!$C$15=\"\",0,'Mål 4'!$C$15)","v":0},{"$f":"IF('Mål 4'!$I$15=\"\",0,'Mål 4'!$I$15)","v":0},{"$f":"IF('Mål 4'!$J$15=\"\",0,'Mål 4'!$J$15)","v":0},{"$f":"IF('Mål 4'!$K$15=\"\",0,'Mål 4'!$K$15)","v":"00:00:00"}]
[null,null,"Mål 4",{"$f":"IF('Mål 4'!$C$16=\"\",0,'Mål 4'!$C$16)","v":0},{"$f":"IF('Mål 4'!$I$16=\"\",0,'Mål 4'!$I$16)","v":0},{"$f":"IF('Mål 4'!$J$16=\"\",0,'Mål 4'!$J$16)","v":0},{"$f":"IF('Mål 4'!$K$16=\"\",0,'Mål 4'!$K$16)","v":"00:00:00"}]
[null,null,"Mål 4",{"$f":"IF('Mål 4'!$C$17=\"\",0,'Mål 4'!$C$17)","v":0},{"$f":"IF('Mål 4'!$I$17=\"\",0,'Mål 4'!$I$17)","v":0},{"$f":"IF('Mål 4'!$J$17=\"\",0,'Mål 4'!$J$17)","v":0},{"$f":"IF('Mål 4'!$K$17=\"\",0,'Mål 4'!$K$17)","v":"00:00:00"}]
[null,null,"Mål 4",{"$f":"IF('Mål 4'!$C$18=\"\",0,'Mål 4'!$C$18)","v":0},{"$f":"IF('Mål 4'!$I$18=\"\",0,'Mål 4'!$I$18)","v":0},{"$f":"IF('Mål 4'!$J$18=\"\",0,'Mål 4'!$J$18)","v":0},{"$f":"IF('Mål 4'!$K$18=\"\",0,'Mål 4'!$K$18)","v":"00:00:00"}]
[null,null,"Mål 4",{"$f":"IF('Mål 4'!$C$19=\"\",0,'Mål 4'!$C$19)","v":0},{"$f":"IF('Mål 4'!$I$19=\"\",0,'Mål 4'!$I$19)","v":0},{"$f":"IF('Mål 4'!$J$19=\"\",0,'Mål 4'!$J$19)","v":0},{"$f":"IF('Mål 4'!$K$19=\"\",0,'Mål 4'!$K$19)","v":"00:00:00"}]
[null,null,"Mål 4",{"$f":"IF('Mål 4'!$C$20=\"\",0,'Mål 4'!$C$20)","v":0},{"$f":"IF('Mål 4'!$I$20=\"\",0,'Mål 4'!$I$20)","v":0},{"$f":"IF('Mål 4'!$J$20=\"\",0,'Mål 4'!$J$20)","v":0},{"$f":"IF('Mål 4'!$K$20=\"\",0,'Mål 4'!$K$20)","v":"00:00:00"}]
[null,null,"Mål 4",{"$f":"IF('Mål 4'!$C$21=\"\",0,'Mål 4'!$C$21)","v":0},{"$f":"IF('Mål 4'!$I$21=\"\",0,'Mål 4'!$I$21)","v":0},{"$f":"IF('Mål 4'!$J$21=\"\",0,'Mål 4'!$J$21)","v":0},{"$f":"IF('Mål 4'!$K$21=\"\",0,'Mål 4'!$K$21)","v":"00:00:00"}]
[null,null,"Mål 4",{"$f":"IF('Mål 4'!$C$22=\"\",0,'Mål 4'!$C$22)","v":0},{"$f":"IF('Mål 4'!$I$22=\"\",0,'Mål 4'!$I$22)","v":0},{"$f":"IF('Mål 4'!$J$22=\"\",0,'Mål 4'!$J$22)","v":0},{"$f":"IF('Mål 4'!$K$22=\"\",0,'Mål 4'!$K$22)","v":"00:00:00"}]
[null,null,"Mål 4",{"$f":"IF('Mål 4'!$C$23=\"\",0,'Mål 4'!$C$23)","v":0},{"$f":"IF('Mål 4'!$I$23=\"\",0,'Mål 4'!$I$23)","v":0},{"$f":"IF('Mål 4'!$J$23=\"\",0,'Mål 4'!$J$23)","v":0},{"$f":"IF('Mål 4'!$K$23=\"\",0,'Mål 4'!$K$23)","v":"00:00:00"}]
[null,null,"Mål 4",{"$f":"IF('Mål 4'!$C$24=\"\",0,'Mål 4'!$C$24)","v":0},{"$f":"IF('Mål 4'!$I$24=\"\",0,'Mål 4'!$I$24)","v":0},{"$f":"IF('Mål 4'!$J$24=\"\",0,'Mål 4'!$J$24)","v":0},{"$f":"IF('Mål 4'!$K$24=\"\",0,'Mål 4'!$K$24)","v":"00:00:00"}]
[null,null,"Mål 4",{"$f":"IF('Mål 4'!$C$25=\"\",0,'Mål 4'!$C$25)","v":0},{"$f":"IF('Mål 4'!$I$25=\"\",0,'Mål 4'!$I$25)","v":0},{"$f":"IF('Mål 4'!$J$25=\"\",0,'Mål 4'!$J$25)","v":0},{"$f":"IF('Mål 4'!$K$25=\"\",0,'Mål 4'!$K$25)","v":"00:00:00"}]
[null,null,"Mål 4",{"$f":"IF('Mål 4'!$C$26=\"\",0,'Mål 4'!$C$26)","v":0},{"$f":"IF('Mål 4'!$I$26=\"\",0,'Mål 4'!$I$26)","v":0},{"$f":"IF('Mål 4'!$J$26=\"\",0,'Mål 4'!$J$26)","v":0},{"$f":"IF('Mål 4'!$K$26=\"\",0,'Mål 4'!$K$26)","v":"00:00:00"}]
[null,null,"Mål 4",{"$f":"IF('Mål 4'!$C$27=\"\",0,'Mål 4'!$C$27)","v":0},{"$f":"IF('Mål 4'!$I$27=\"\",0,'Mål 4'!$I$27)","v":0},{"$f":"IF('Mål 4'!$J$27=\"\",0,'Mål 4'!$J$27)","v":0},{"$f":"IF('Mål 4'!$K$27=\"\",0,'Mål 4'!$K$27)","v":"00:00:00"}]
[null,null,"Mål 5",{"$f":"IF('Mål 5'!$C$8=\"\",0,'Mål 5'!$C$8)","v":0},{"$f":"IF('Mål 5'!$I$8=\"\",0,'Mål 5'!$I$8)","v":0},{"$f":"IF('Mål 5'!$J$8=\"\",0,'Mål 5'!$J$8)","v":0},{"$f":"IF('Mål 5'!$K$8=\"\",0,'Mål 5'!$K$8)","v":"00:00:00"}]
[null,null,"Mål 5",{"$f":"IF('Mål 5'!$C$9=\"\",0,'Mål 5'!$C$9)","v":0},{"$f":"IF('Mål 5'!$I$9=\"\",0,'Mål 5'!$I$9)","v":0},{"$f":"IF('Mål 5'!$J$9=\"\",0,'Mål 5'!$J$9)","v":0},{"$f":"IF('Mål 5'!$K$9=\"\",0,'Mål 5'!$K$9)","v":"00:00:00"}]
[null,null,"Mål 5",{"$f":"IF('Mål 5'!$C$10=\"\",0,'Mål 5'!$C$10)","v":0},{"$f":"IF('Mål 5'!$I$10=\"\",0,'Mål 5'!$I$10)","v":0},{"$f":"IF('Mål 5'!$J$10=\"\",0,'Mål 5'!$J$10)","v":0},{"$f":"IF('Mål 5'!$K$10=\"\",0,'Mål 5'!$K$10)","v":"00:00:00"}]
[null,null,"Mål 5",{"$f":"IF('Mål 5'!$C$11=\"\",0,'Mål 5'!$C91)","v":0},{"$f":"IF('Mål 5'!$I$11=\"\",0,'Mål 5'!$I91)","v":0},{"$f":"IF('Mål 5'!$J$11=\"\",0,'Mål 5'!$J91)","v":0},{"$f":"IF('Mål 5'!$K$11=\"\",0,'Mål 5'!$K91)","v":"00:00:00"}]
[null,null,"Mål 5",{"$f":"IF('Mål 5'!$C$12=\"\",0,'Mål 5'!$C$12)","v":0},{"$f":"IF('Mål 5'!$I$12=\"\",0,'Mål 5'!$I$12)","v":0},{"$f":"IF('Mål 5'!$J$12=\"\",0,'Mål 5'!$J$12)","v":0},{"$f":"IF('Mål 5'!$K$12=\"\",0,'Mål 5'!$K$12)","v":"00:00:00"}]
[null,null,"Mål 5",{"$f":"IF('Mål 5'!$C$13=\"\",0,'Mål 5'!$C$13)","v":0},{"$f":"IF('Mål 5'!$I$13=\"\",0,'Mål 5'!$I$13)","v":0},{"$f":"IF('Mål 5'!$J$13=\"\",0,'Mål 5'!$J$13)","v":0},{"$f":"IF('Mål 5'!$K$13=\"\",0,'Mål 5'!$K$13)","v":"00:00:00"}]
[null,null,"Mål 5",{"$f":"IF('Mål 5'!$C$14=\"\",0,'Mål 5'!$C$14)","v":0},{"$f":"IF('Mål 5'!$I$14=\"\",0,'Mål 5'!$I$14)","v":0},{"$f":"IF('Mål 5'!$J$14=\"\",0,'Mål 5'!$J$14)","v":0},{"$f":"IF('Mål 5'!$K$14=\"\",0,'Mål 5'!$K$14)","v":"00:00:00"}]
[null,null,"Mål 5",{"$f":"IF('Mål 5'!$C$15=\"\",0,'Mål 5'!$C$15)","v":0},{"$f":"IF('Mål 5'!$I$15=\"\",0,'Mål 5'!$I$15)","v":0},{"$f":"IF('Mål 5'!$J$15=\"\",0,'Mål 5'!$J$15)","v":0},{"$f":"IF('Mål 5'!$K$15=\"\",0,'Mål 5'!$K$15)","v":"00:00:00"}]
[null,null,"Mål 5",{"$f":"IF('Mål 5'!$C$16=\"\",0,'Mål 5'!$C$16)","v":0},{"$f":"IF('Mål 5'!$I$16=\"\",0,'Mål 5'!$I$16)","v":0},{"$f":"IF('Mål 5'!$J$16=\"\",0,'Mål 5'!$J$16)","v":0},{"$f":"IF('Mål 5'!$K$16=\"\",0,'Mål 5'!$K$16)","v":"00:00:00"}]
[null,null,"Mål 5",{"$f":"IF('Mål 5'!$C$17=\"\",0,'Mål 5'!$C$17)","v":0},{"$f":"IF('Mål 5'!$I$17=\"\",0,'Mål 5'!$I$17)","v":0},{"$f":"IF('Mål 5'!$J$17=\"\",0,'Mål 5'!$J$17)","v":0},{"$f":"IF('Mål 5'!$K$17=\"\",0,'Mål 5'!$K$17)","v":"00:00:00"}]
[null,null,"Mål 5",{"$f":"IF('Mål 5'!$C$18=\"\",0,'Mål 5'!$C$18)","v":0},{"$f":"IF('Mål 5'!$I$18=\"\",0,'Mål 5'!$I$18)","v":0},{"$f":"IF('Mål 5'!$J$18=\"\",0,'Mål 5'!$J$18)","v":0},{"$f":"IF('Mål 5'!$K$18=\"\",0,'Mål 5'!$K$18)","v":"00:00:00"}]
[null,null,"Mål 5",{"$f":"IF('Mål 5'!$C$19=\"\",0,'Mål 5'!$C$19)","v":0},{"$f":"IF('Mål 5'!$I$19=\"\",0,'Mål 5'!$I$19)","v":0},{"$f":"IF('Mål 5'!$J$19=\"\",0,'Mål 5'!$J$19)","v":0},{"$f":"IF('Mål 5'!$K$19=\"\",0,'Mål 5'!$K$19)","v":"00:00:00"}]
[null,null,"Mål 5",{"$f":"IF('Mål 5'!$C$20=\"\",0,'Mål 5'!$C$20)","v":0},{"$f":"IF('Mål 5'!$I$20=\"\",0,'Mål 5'!$I$20)","v":0},{"$f":"IF('Mål 5'!$J$20=\"\",0,'Mål 5'!$J$20)","v":0},{"$f":"IF('Mål 5'!$K$20=\"\",0,'Mål 5'!$K$20)","v":"00:00:00"}]
[null,null,"Mål 5",{"$f":"IF('Mål 5'!$C$21=\"\",0,'Mål 5'!$C$21)","v":0},{"$f":"IF('Mål 5'!$I$21=\"\",0,'Mål 5'!$I$21)","v":0},{"$f":"IF('Mål 5'!$J$21=\"\",0,'Mål 5'!$J$21)","v":0},{"$f":"IF('Mål 5'!$K$21=\"\",0,'Mål 5'!$K$21)","v":"00:00:00"}]
[null,null,"Mål 5",{"$f":"IF('Mål 5'!$C$22=\"\",0,'Mål 5'!$C$22)","v":0},{"$f":"IF('Mål 5'!$I$22=\"\",0,'Mål 5'!$I$22)","v":0},{"$f":"IF('Mål 5'!$J$22=\"\",0,'Mål 5'!$J$22)","v":0},{"$f":"IF('Mål 5'!$K$22=\"\",0,'Mål 5'!$K$22)","v":"00:00:00"}]
[null,null,"Mål 5",{"$f":"IF('Mål 5'!$C$23=\"\",0,'Mål 5'!$C$23)","v":0},{"$f":"IF('Mål 5'!$I$23=\"\",0,'Mål 5'!$I$23)","v":0},{"$f":"IF('Mål 5'!$J$23=\"\",0,'Mål 5'!$J$23)","v":0},{"$f":"IF('Mål 5'!$K$23=\"\",0,'Mål 5'!$K$23)","v":"00:00:00"}]
[null,null,"Mål 5",{"$f":"IF('Mål 5'!$C$24=\"\",0,'Mål 5'!$C$24)","v":0},{"$f":"IF('Mål 5'!$I$24=\"\",0,'Mål 5'!$I$24)","v":0},{"$f":"IF('Mål 5'!$J$24=\"\",0,'Mål 5'!$J$24)","v":0},{"$f":"IF('Mål 5'!$K$24=\"\",0,'Mål 5'!$K$24)","v":"00:00:00"}]
[null,null,"Mål 5",{"$f":"IF('Mål 5'!$C$25=\"\",0,'Mål 5'!$C$25)","v":0},{"$f":"IF('Mål 5'!$I$25=\"\",0,'Mål 5'!$I$25)","v":0},{"$f":"IF('Mål 5'!$J$25=\"\",0,'Mål 5'!$J$25)","v":0},{"$f":"IF('Mål 5'!$K$25=\"\",0,'Mål 5'!$K$25)","v":"00:00:00"}]
[null,null,"Mål 5",{"$f":"IF('Mål 5'!$C$26=\"\",0,'Mål 5'!$C$26)","v":0},{"$f":"IF('Mål 5'!$I$26=\"\",0,'Mål 5'!$I$26)","v":0},{"$f":"IF('Mål 5'!$J$26=\"\",0,'Mål 5'!$J$26)","v":0},{"$f":"IF('Mål 5'!$K$26=\"\",0,'Mål 5'!$K$26)","v":"00:00:00"}]
[null,null,"Mål 5",{"$f":"IF('Mål 5'!$C$27=\"\",0,'Mål 5'!$C$27)","v":0},{"$f":"IF('Mål 5'!$I$27=\"\",0,'Mål 5'!$I$27)","v":0},{"$f":"IF('Mål 5'!$J$27=\"\",0,'Mål 5'!$J$27)","v":0},{"$f":"IF('Mål 5'!$K$27=\"\",0,'Mål 5'!$K$27)","v":"00:00:00"}]
[null,null,"Mål 6",{"$f":"IF('Mål 6'!$C$8=\"\",0,'Mål 6'!$C$8)","v":0},{"$f":"IF('Mål 6'!$I$8=\"\",0,'Mål 6'!$I$8)","v":0},{"$f":"IF('Mål 6'!$J$8=\"\",0,'Mål 6'!$J$8)","v":0},{"$f":"IF('Mål 6'!$K$8=\"\",0,'Mål 6'!$K$8)","v":"00:00:00"}]
[null,null,"Mål 6",{"$f":"IF('Mål 6'!$C$9=\"\",0,'Mål 6'!$C$9)","v":0},{"$f":"IF('Mål 6'!$I$9=\"\",0,'Mål 6'!$I$9)","v":0},{"$f":"IF('Mål 6'!$J$9=\"\",0,'Mål 6'!$J$9)","v":0},{"$f":"IF('Mål 6'!$K$9=\"\",0,'Mål 6'!$K$9)","v":"00:00:00"}]
[null,null,"Mål 6",{"$f":"IF('Mål 6'!$C$10=\"\",0,'Mål 6'!$C$10)","v":0},{"$f":"IF('Mål 6'!$I$10=\"\",0,'Mål 6'!$I$10)","v":0},{"$f":"IF('Mål 6'!$J$10=\"\",0,'Mål 6'!$J$10)","v":0},{"$f":"IF('Mål 6'!$K$10=\"\",0,'Mål 6'!$K$10)","v":"00:00:00"}]
[null,null,"Mål 6",{"$f":"IF('Mål 6'!$C$11=\"\",0,'Mål 6'!$C111)","v":0},{"$f":"IF('Mål 6'!$I$11=\"\",0,'Mål 6'!$I111)","v":0},{"$f":"IF('Mål 6'!$J$11=\"\",0,'Mål 6'!$J111)","v":0},{"$f":"IF('Mål 6'!$K$11=\"\",0,'Mål 6'!$K111)","v":"00:00:00"}]
[null,null,"Mål 6",{"$f":"IF('Mål 6'!$C$12=\"\",0,'Mål 6'!$C$12)","v":0},{"$f":"IF('Mål 6'!$I$12=\"\",0,'Mål 6'!$I$12)","v":0},{"$f":"IF('Mål 6'!$J$12=\"\",0,'Mål 6'!$J$12)","v":0},{"$f":"IF('Mål 6'!$K$12=\"\",0,'Mål 6'!$K$12)","v":"00:00:00"}]
[null,null,"Mål 6",{"$f":"IF('Mål 6'!$C$13=\"\",0,'Mål 6'!$C$13)","v":0},{"$f":"IF('Mål 6'!$I$13=\"\",0,'Mål 6'!$I$13)","v":0},{"$f":"IF('Mål 6'!$J$13=\"\",0,'Mål 6'!$J$13)","v":0},{"$f":"IF('Mål 6'!$K$13=\"\",0,'Mål 6'!$K$13)","v":"00:00:00"}]
[null,null,"Mål 6",{"$f":"IF('Mål 6'!$C$14=\"\",0,'Mål 6'!$C$14)","v":0},{"$f":"IF('Mål 6'!$I$14=\"\",0,'Mål 6'!$I$14)","v":0},{"$f":"IF('Mål 6'!$J$14=\"\",0,'Mål 6'!$J$14)","v":0},{"$f":"IF('Mål 6'!$K$14=\"\",0,'Mål 6'!$K$14)","v":"00:00:00"}]
[null,null,"Mål 6",{"$f":"IF('Mål 6'!$C$15=\"\",0,'Mål 6'!$C$15)","v":0},{"$f":"IF('Mål 6'!$I$15=\"\",0,'Mål 6'!$I$15)","v":0},{"$f":"IF('Mål 6'!$J$15=\"\",0,'Mål 6'!$J$15)","v":0},{"$f":"IF('Mål 6'!$K$15=\"\",0,'Mål 6'!$K$15)","v":"00:00:00"}]
[null,null,"Mål 6",{"$f":"IF('Mål 6'!$C$16=\"\",0,'Mål 6'!$C$16)","v":0},{"$f":"IF('Mål 6'!$I$16=\"\",0,'Mål 6'!$I$16)","v":0},{"$f":"IF('Mål 6'!$J$16=\"\",0,'Mål 6'!$J$16)","v":0},{"$f":"IF('Mål 6'!$K$16=\"\",0,'Mål 6'!$K$16)","v":"00:00:00"}]
[null,null,"Mål 6",{"$f":"IF('Mål 6'!$C$17=\"\",0,'Mål 6'!$C$17)","v":0},{"$f":"IF('Mål 6'!$I$17=\"\",0,'Mål 6'!$I$17)","v":0},{"$f":"IF('Mål 6'!$J$17=\"\",0,'Mål 6'!$J$17)","v":0},{"$f":"IF('Mål 6'!$K$17=\"\",0,'Mål 6'!$K$17)","v":"00:00:00"}]
[null,null,"Mål 6",{"$f":"IF('Mål 6'!$C$18=\"\",0,'Mål 6'!$C$18)","v":0},{"$f":"IF('Mål 6'!$I$18=\"\",0,'Mål 6'!$I$18)","v":0},{"$f":"IF('Mål 6'!$J$18=\"\",0,'Mål 6'!$J$18)","v":0},{"$f":"IF('Mål 6'!$K$18=\"\",0,'Mål 6'!$K$18)","v":"00:00:00"}]
[null,null,"Mål 6",{"$f":"IF('Mål 6'!$C$19=\"\",0,'Mål 6'!$C$19)","v":0},{"$f":"IF('Mål 6'!$I$19=\"\",0,'Mål 6'!$I$19)","v":0},{"$f":"IF('Mål 6'!$J$19=\"\",0,'Mål 6'!$J$19)","v":0},{"$f":"IF('Mål 6'!$K$19=\"\",0,'Mål 6'!$K$19)","v":"00:00:00"}]
[null,null,"Mål 6",{"$f":"IF('Mål 6'!$C$20=\"\",0,'Mål 6'!$C$20)","v":0},{"$f":"IF('Mål 6'!$I$20=\"\",0,'Mål 6'!$I$20)","v":0},{"$f":"IF('Mål 6'!$J$20=\"\",0,'Mål 6'!$J$20)","v":0},{"$f":"IF('Mål 6'!$K$20=\"\",0,'Mål 6'!$K$20)","v":"00:00:00"}]
[null,null,"Mål 6",{"$f":"IF('Mål 6'!$C$21=\"\",0,'Mål 6'!$C$21)","v":0},{"$f":"IF('Mål 6'!$I$21=\"\",0,'Mål 6'!$I$21)","v":0},{"$f":"IF('Mål 6'!$J$21=\"\",0,'Mål 6'!$J$21)","v":0},{"$f":"IF('Mål 6'!$K$21=\"\",0,'Mål 6'!$K$21)","v":"00:00:00"}]
[null,null,"Mål 6",{"$f":"IF('Mål 6'!$C$22=\"\",0,'Mål 6'!$C$22)","v":0},{"$f":"IF('Mål 6'!$I$22=\"\",0,'Mål 6'!$I$22)","v":0},{"$f":"IF('Mål 6'!$J$22=\"\",0,'Mål 6'!$J$22)","v":0},{"$f":"IF('Mål 6'!$K$22=\"\",0,'Mål 6'!$K$22)","v":"00:00:00"}]
[null,null,"Mål 6",{"$f":"IF('Mål 6'!$C$23=\"\",0,'Mål 6'!$C$23)","v":0},{"$f":"IF('Mål 6'!$I$23=\"\",0,'Mål 6'!$I$23)","v":0},{"$f":"IF('Mål 6'!$J$23=\"\",0,'Mål 6'!$J$23)","v":0},{"$f":"IF('Mål 6'!$K$23=\"\",0,'Mål 6'!$K$23)","v":"00:00:00"}]
[null,null,"Mål 6",{"$f":"IF('Mål 6'!$C$24=\"\",0,'Mål 6'!$C$24)","v":0},{"$f":"IF('Mål 6'!$I$24=\"\",0,'Mål 6'!$I$24)","v":0},{"$f":"IF('Mål 6'!$J$24=\"\",0,'Mål 6'!$J$24)","v":0},{"$f":"IF('Mål 6'!$K$24=\"\",0,'Mål 6'!$K$24)","v":"00:00:00"}]
[null,null,"Mål 6",{"$f":"IF('Mål 6'!$C$25=\"\",0,'Mål 6'!$C$25)","v":0},{"$f":"IF('Mål 6'!$I$25=\"\",0,'Mål 6'!$I$25)","v":0},{"$f":"IF('Mål 6'!$J$25=\"\",0,'Mål 6'!$J$25)","v":0},{"$f":"IF('Mål 6'!$K$25=\"\",0,'Mål 6'!$K$25)","v":"00:00:00"}]
[null,null,"Mål 6",{"$f":"IF('Mål 6'!$C$26=\"\",0,'Mål 6'!$C$26)","v":0},{"$f":"IF('Mål 6'!$I$26=\"\",0,'Mål 6'!$I$26)","v":0},{"$f":"IF('Mål 6'!$J$26=\"\",0,'Mål 6'!$J$26)","v":0},{"$f":"IF('Mål 6'!$K$26=\"\",0,'Mål 6'!$K$26)","v":"00:00:00"}]
[null,null,"Mål 6",{"$f":"IF('Mål 6'!$C$27=\"\",0,'Mål 6'!$C$27)","v":0},{"$f":"IF('Mål 6'!$I$27=\"\",0,'Mål 6'!$I$27)","v":0},{"$f":"IF('Mål 6'!$J$27=\"\",0,'Mål 6'!$J$27)","v":0},{"$f":"IF('Mål 6'!$K$27=\"\",0,'Mål 6'!$K$27)","v":"00:00:00"}]
[null,null,"Mål 7",{"$f":"IF('Mål 7'!$C$8=\"\",0,'Mål 7'!$C$8)","v":0},{"$f":"IF('Mål 7'!$I$8=\"\",0,'Mål 7'!$I$8)","v":0},{"$f":"IF('Mål 7'!$J$8=\"\",0,'Mål 7'!$J$8)","v":0},{"$f":"IF('Mål 7'!$K$8=\"\",0,'Mål 7'!$K$8)","v":"00:00:00"}]
[null,null,"Mål 7",{"$f":"IF('Mål 7'!$C$9=\"\",0,'Mål 7'!$C$9)","v":0},{"$f":"IF('Mål 7'!$I$9=\"\",0,'Mål 7'!$I$9)","v":0},{"$f":"IF('Mål 7'!$J$9=\"\",0,'Mål 7'!$J$9)","v":0},{"$f":"IF('Mål 7'!$K$9=\"\",0,'Mål 7'!$K$9)","v":"00:00:00"}]
[null,null,"Mål 7",{"$f":"IF('Mål 7'!$C$10=\"\",0,'Mål 7'!$C$10)","v":0},{"$f":"IF('Mål 7'!$I$10=\"\",0,'Mål 7'!$I$10)","v":0},{"$f":"IF('Mål 7'!$J$10=\"\",0,'Mål 7'!$J$10)","v":0},{"$f":"IF('Mål 7'!$K$10=\"\",0,'Mål 7'!$K$10)","v":"00:00:00"}]
[null,null,"Mål 7",{"$f":"IF('Mål 7'!$C$11=\"\",0,'Mål 7'!$C131)","v":0},{"$f":"IF('Mål 7'!$I$11=\"\",0,'Mål 7'!$I131)","v":0},{"$f":"IF('Mål 7'!$J$11=\"\",0,'Mål 7'!$J131)","v":0},{"$f":"IF('Mål 7'!$K$11=\"\",0,'Mål 7'!$K131)","v":"00:00:00"}]
[null,null,"Mål 7",{"$f":"IF('Mål 7'!$C$12=\"\",0,'Mål 7'!$C$12)","v":0},{"$f":"IF('Mål 7'!$I$12=\"\",0,'Mål 7'!$I$12)","v":0},{"$f":"IF('Mål 7'!$J$12=\"\",0,'Mål 7'!$J$12)","v":0},{"$f":"IF('Mål 7'!$K$12=\"\",0,'Mål 7'!$K$12)","v":"00:00:00"}]
[null,null,"Mål 7",{"$f":"IF('Mål 7'!$C$13=\"\",0,'Mål 7'!$C$13)","v":0},{"$f":"IF('Mål 7'!$I$13=\"\",0,'Mål 7'!$I$13)","v":0},{"$f":"IF('Mål 7'!$J$13=\"\",0,'Mål 7'!$J$13)","v":0},{"$f":"IF('Mål 7'!$K$13=\"\",0,'Mål 7'!$K$13)","v":"00:00:00"}]
[null,null,"Mål 7",{"$f":"IF('Mål 7'!$C$14=\"\",0,'Mål 7'!$C$14)","v":0},{"$f":"IF('Mål 7'!$I$14=\"\",0,'Mål 7'!$I$14)","v":0},{"$f":"IF('Mål 7'!$J$14=\"\",0,'Mål 7'!$J$14)","v":0},{"$f":"IF('Mål 7'!$K$14=\"\",0,'Mål 7'!$K$14)","v":"00:00:00"}]
[null,null,"Mål 7",{"$f":"IF('Mål 7'!$C$15=\"\",0,'Mål 7'!$C$15)","v":0},{"$f":"IF('Mål 7'!$I$15=\"\",0,'Mål 7'!$I$15)","v":0},{"$f":"IF('Mål 7'!$J$15=\"\",0,'Mål 7'!$J$15)","v":0},{"$f":"IF('Mål 7'!$K$15=\"\",0,'Mål 7'!$K$15)","v":"00:00:00"}]
[null,null,"Mål 7",{"$f":"IF('Mål 7'!$C$16=\"\",0,'Mål 7'!$C$16)","v":0},{"$f":"IF('Mål 7'!$I$16=\"\",0,'Mål 7'!$I$16)","v":0},{"$f":"IF('Mål 7'!$J$16=\"\",0,'Mål 7'!$J$16)","v":0},{"$f":"IF('Mål 7'!$K$16=\"\",0,'Mål 7'!$K$16)","v":"00:00:00"}]
[null,null,"Mål 7",{"$f":"IF('Mål 7'!$C$17=\"\",0,'Mål 7'!$C$17)","v":0},{"$f":"IF('Mål 7'!$I$17=\"\",0,'Mål 7'!$I$17)","v":0},{"$f":"IF('Mål 7'!$J$17=\"\",0,'Mål 7'!$J$17)","v":0},{"$f":"IF('Mål 7'!$K$17=\"\",0,'Mål 7'!$K$17)","v":"00:00:00"}]
[null,null,"Mål 7",{"$f":"IF('Mål 7'!$C$18=\"\",0,'Mål 7'!$C$18)","v":0},{"$f":"IF('Mål 7'!$I$18=\"\",0,'Mål 7'!$I$18)","v":0},{"$f":"IF('Mål 7'!$J$18=\"\",0,'Mål 7'!$J$18)","v":0},{"$f":"IF('Mål 7'!$K$18=\"\",0,'Mål 7'!$K$18)","v":"00:00:00"}]
[null,null,"Mål 7",{"$f":"IF('Mål 7'!$C$19=\"\",0,'Mål 7'!$C$19)","v":0},{"$f":"IF('Mål 7'!$I$19=\"\",0,'Mål 7'!$I$19)","v":0},{"$f":"IF('Mål 7'!$J$19=\"\",0,'Mål 7'!$J$19)","v":0},{"$f":"IF('Mål 7'!$K$19=\"\",0,'Mål 7'!$K$19)","v":"00:00:00"}]
[null,null,"Mål 7",{"$f":"IF('Mål 7'!$C$20=\"\",0,'Mål 7'!$C$20)","v":0},{"$f":"IF('Mål 7'!$I$20=\"\",0,'Mål 7'!$I$20)","v":0},{"$f":"IF('Mål 7'!$J$20=\"\",0,'Mål 7'!$J$20)","v":0},{"$f":"IF('Mål 7'!$K$20=\"\",0,'Mål 7'!$K$20)","v":"00:00:00"}]
[null,null,"Mål 7",{"$f":"IF('Mål 7'!$C$21=\"\",0,'Mål 7'!$C$21)","v":0},{"$f":"IF('Mål 7'!$I$21=\"\",0,'Mål 7'!$I$21)","v":0},{"$f":"IF('Mål 7'!$J$21=\"\",0,'Mål 7'!$J$21)","v":0},{"$f":"IF('Mål 7'!$K$21=\"\",0,'Mål 7'!$K$21)","v":"00:00:00"}]
[null,null,"Mål 7",{"$f":"IF('Mål 7'!$C$22=\"\",0,'Mål 7'!$C$22)","v":0},{"$f":"IF('Mål 7'!$I$22=\"\",0,'Mål 7'!$I$22)","v":0},{"$f":"IF('Mål 7'!$J$22=\"\",0,'Mål 7'!$J$22)","v":0},{"$f":"IF('Mål 7'!$K$22=\"\",0,'Mål 7'!$K$22)","v":"00:00:00"}]
[null,null,"Mål 7",{"$f":"IF('Mål 7'!$C$23=\"\",0,'Mål 7'!$C$23)","v":0},{"$f":"IF('Mål 7'!$I$23=\"\",0,'Mål 7'!$I$23)","v":0},{"$f":"IF('Mål 7'!$J$23=\"\",0,'Mål 7'!$J$23)","v":0},{"$f":"IF('Mål 7'!$K$23=\"\",0,'Mål 7'!$K$23)","v":"00:00:00"}]
[null,null,"Mål 7",{"$f":"IF('Mål 7'!$C$24=\"\",0,'Mål 7'!$C$24)","v":0},{"$f":"IF('Mål 7'!$I$24=\"\",0,'Mål 7'!$I$24)","v":0},{"$f":"IF('Mål 7'!$J$24=\"\",0,'Mål 7'!$J$24)","v":0},{"$f":"IF('Mål 7'!$K$24=\"\",0,'Mål 7'!$K$24)","v":"00:00:00"}]
[null,null,"Mål 7",{"$f":"IF('Mål 7'!$C$25=\"\",0,'Mål 7'!$C$25)","v":0},{"$f":"IF('Mål 7'!$I$25=\"\",0,'Mål 7'!$I$25)","v":0},{"$f":"IF('Mål 7'!$J$25=\"\",0,'Mål 7'!$J$25)","v":0},{"$f":"IF('Mål 7'!$K$25=\"\",0,'Mål 7'!$K$25)","v":"00:00:00"}]
[null,null,"Mål 7",{"$f":"IF('Mål 7'!$C$26=\"\",0,'Mål 7'!$C$26)","v":0},{"$f":"IF('Mål 7'!$I$26=\"\",0,'Mål 7'!$I$26)","v":0},{"$f":"IF('Mål 7'!$J$26=\"\",0,'Mål 7'!$J$26)","v":0},{"$f":"IF('Mål 7'!$K$26=\"\",0,'Mål 7'!$K$26)","v":"00:00:00"}]
[null,null,"Mål 7",{"$f":"IF('Mål 7'!$C$27=\"\",0,'Mål 7'!$C$27)","v":0},{"$f":"IF('Mål 7'!$I$27=\"\",0,'Mål 7'!$I$27)","v":0},{"$f":"IF('Mål 7'!$J$27=\"\",0,'Mål 7'!$J$27)","v":0},{"$f":"IF('Mål 7'!$K$27=\"\",0,'Mål 7'!$K$27)","v":"00:00:00"}]
[null,null,"Mål 8",{"$f":"IF('Mål 8'!$C$8=\"\",0,'Mål 8'!$C$8)","v":0},{"$f":"IF('Mål 8'!$I$8=\"\",0,'Mål 8'!$I$8)","v":0},{"$f":"IF('Mål 8'!$J$8=\"\",0,'Mål 8'!$J$8)","v":0},{"$f":"IF('Mål 8'!$K$8=\"\",0,'Mål 8'!$K$8)","v":"00:00:00"}]
[null,null,"Mål 8",{"$f":"IF('Mål 8'!$C$9=\"\",0,'Mål 8'!$C$9)","v":0},{"$f":"IF('Mål 8'!$I$9=\"\",0,'Mål 8'!$I$9)","v":0},{"$f":"IF('Mål 8'!$J$9=\"\",0,'Mål 8'!$J$9)","v":0},{"$f":"IF('Mål 8'!$K$9=\"\",0,'Mål 8'!$K$9)","v":"00:00:00"}]
[null,null,"Mål 8",{"$f":"IF('Mål 8'!$C$10=\"\",0,'Mål 8'!$C$10)","v":0},{"$f":"IF('Mål 8'!$I$10=\"\",0,'Mål 8'!$I$10)","v":0},{"$f":"IF('Mål 8'!$J$10=\"\",0,'Mål 8'!$J$10)","v":0},{"$f":"IF('Mål 8'!$K$10=\"\",0,'Mål 8'!$K$10)","v":"00:00:00"}]
[null,null,"Mål 8",{"$f":"IF('Mål 8'!$C$11=\"\",0,'Mål 8'!$C151)","v":0},{"$f":"IF('Mål 8'!$I$11=\"\",0,'Mål 8'!$I151)","v":0},{"$f":"IF('Mål 8'!$J$11=\"\",0,'Mål 8'!$J151)","v":0},{"$f":"IF('Mål 8'!$K$11=\"\",0,'Mål 8'!$K151)","v":"00:00:00"}]
[null,null,"Mål 8",{"$f":"IF('Mål 8'!$C$12=\"\",0,'Mål 8'!$C$12)","v":0},{"$f":"IF('Mål 8'!$I$12=\"\",0,'Mål 8'!$I$12)","v":0},{"$f":"IF('Mål 8'!$J$12=\"\",0,'Mål 8'!$J$12)","v":0},{"$f":"IF('Mål 8'!$K$12=\"\",0,'Mål 8'!$K$12)","v":"00:00:00"}]
[null,null,"Mål 8",{"$f":"IF('Mål 8'!$C$13=\"\",0,'Mål 8'!$C$13)","v":0},{"$f":"IF('Mål 8'!$I$13=\"\",0,'Mål 8'!$I$13)","v":0},{"$f":"IF('Mål 8'!$J$13=\"\",0,'Mål 8'!$J$13)","v":0},{"$f":"IF('Mål 8'!$K$13=\"\",0,'Mål 8'!$K$13)","v":"00:00:00"}]
[null,null,"Mål 8",{"$f":"IF('Mål 8'!$C$14=\"\",0,'Mål 8'!$C$14)","v":0},{"$f":"IF('Mål 8'!$I$14=\"\",0,'Mål 8'!$I$14)","v":0},{"$f":"IF('Mål 8'!$J$14=\"\",0,'Mål 8'!$J$14)","v":0},{"$f":"IF('Mål 8'!$K$14=\"\",0,'Mål 8'!$K$14)","v":"00:00:00"}]
[null,null,"Mål 8",{"$f":"IF('Mål 8'!$C$15=\"\",0,'Mål 8'!$C$15)","v":0},{"$f":"IF('Mål 8'!$I$15=\"\",0,'Mål 8'!$I$15)","v":0},{"$f":"IF('Mål 8'!$J$15=\"\",0,'Mål 8'!$J$15)","v":0},{"$f":"IF('Mål 8'!$K$15=\"\",0,'Mål 8'!$K$15)","v":"00:00:00"}]
[null,null,"Mål 8",{"$f":"IF('Mål 8'!$C$16=\"\",0,'Mål 8'!$C$16)","v":0},{"$f":"IF('Mål 8'!$I$16=\"\",0,'Mål 8'!$I$16)","v":0},{"$f":"IF('Mål 8'!$J$16=\"\",0,'Mål 8'!$J$16)","v":0},{"$f":"IF('Mål 8'!$K$16=\"\",0,'Mål 8'!$K$16)","v":"00:00:00"}]
[null,null,"Mål 8",{"$f":"IF('Mål 8'!$C$17=\"\",0,'Mål 8'!$C$17)","v":0},{"$f":"IF('Mål 8'!$I$17=\"\",0,'Mål 8'!$I$17)","v":0},{"$f":"IF('Mål 8'!$J$17=\"\",0,'Mål 8'!$J$17)","v":0},{"$f":"IF('Mål 8'!$K$17=\"\",0,'Mål 8'!$K$17)","v":"00:00:00"}]
[null,null,"Mål 8",{"$f":"IF('Mål 8'!$C$18=\"\",0,'Mål 8'!$C$18)","v":0},{"$f":"IF('Mål 8'!$I$18=\"\",0,'Mål 8'!$I$18)","v":0},{"$f":"IF('Mål 8'!$J$18=\"\",0,'Mål 8'!$J$18)","v":0},{"$f":"IF('Mål 8'!$K$18=\"\",0,'Mål 8'!$K$18)","v":"00:00:00"}]
[null,null,"Mål 8",{"$f":"IF('Mål 8'!$C$19=\"\",0,'Mål 8'!$C$19)","v":0},{"$f":"IF('Mål 8'!$I$19=\"\",0,'Mål 8'!$I$19)","v":0},{"$f":"IF('Mål 8'!$J$19=\"\",0,'Mål 8'!$J$19)","v":0},{"$f":"IF('Mål 8'!$K$19=\"\",0,'Mål 8'!$K$19)","v":"00:00:00"}]
[null,null,"Mål 8",{"$f":"IF('Mål 8'!$C$20=\"\",0,'Mål 8'!$C$20)","v":0},{"$f":"IF('Mål 8'!$I$20=\"\",0,'Mål 8'!$I$20)","v":0},{"$f":"IF('Mål 8'!$J$20=\"\",0,'Mål 8'!$J$20)","v":0},{"$f":"IF('Mål 8'!$K$20=\"\",0,'Mål 8'!$K$20)","v":"00:00:00"}]
[null,null,"Mål 8",{"$f":"IF('Mål 8'!$C$21=\"\",0,'Mål 8'!$C$21)","v":0},{"$f":"IF('Mål 8'!$I$21=\"\",0,'Mål 8'!$I$21)","v":0},{"$f":"IF('Mål 8'!$J$21=\"\",0,'Mål 8'!$J$21)","v":0},{"$f":"IF('Mål 8'!$K$21=\"\",0,'Mål 8'!$K$21)","v":"00:00:00"}]
[null,null,"Mål 8",{"$f":"IF('Mål 8'!$C$22=\"\",0,'Mål 8'!$C$22)","v":0},{"$f":"IF('Mål 8'!$I$22=\"\",0,'Mål 8'!$I$22)","v":0},{"$f":"IF('Mål 8'!$J$22=\"\",0,'Mål 8'!$J$22)","v":0},{"$f":"IF('Mål 8'!$K$22=\"\",0,'Mål 8'!$K$22)","v":"00:00:00"}]
[null,null,"Mål 8",{"$f":"IF('Mål 8'!$C$23=\"\",0,'Mål 8'!$C$23)","v":0},{"$f":"IF('Mål 8'!$I$23=\"\",0,'Mål 8'!$I$23)","v":0},{"$f":"IF('Mål 8'!$J$23=\"\",0,'Mål 8'!$J$23)","v":0},{"$f":"IF('Mål 8'!$K$23=\"\",0,'Mål 8'!$K$23)","v":"00:00:00"}]
[null,null,"Mål 8",{"$f":"IF('Mål 8'!$C$24=\"\",0,'Mål 8'!$C$24)","v":0},{"$f":"IF('Mål 8'!$I$24=\"\",0,'Mål 8'!$I$24)","v":0},{"$f":"IF('Mål 8'!$J$24=\"\",0,'Mål 8'!$J$24)","v":0},{"$f":"IF('Mål 8'!$K$24=\"\",0,'Mål 8'!$K$24)","v":"00:00:00"}]
[null,null,"Mål 8",{"$f":"IF('Mål 8'!$C$25=\"\",0,'Mål 8'!$C$25)","v":0},{"$f":"IF('Mål 8'!$I$25=\"\",0,'Mål 8'!$I$25)","v":0},{"$f":"IF('Mål 8'!$J$25=\"\",0,'Mål 8'!$J$25)","v":0},{"$f":"IF('Mål 8'!$K$25=\"\",0,'Mål 8'!$K$25)","v":"00:00:00"}]
[null,null,"Mål 8",{"$f":"IF('Mål 8'!$C$26=\"\",0,'Mål 8'!$C$26)","v":0},{"$f":"IF('Mål 8'!$I$26=\"\",0,'Mål 8'!$I$26)","v":0},{"$f":"IF('Mål 8'!$J$26=\"\",0,'Mål 8'!$J$26)","v":0},{"$f":"IF('Mål 8'!$K$26=\"\",0,'Mål 8'!$K$26)","v":"00:00:00"}]
[null,null,"Mål 8",{"$f":"IF('Mål 8'!$C$27=\"\",0,'Mål 8'!$C$27)","v":0},{"$f":"IF('Mål 8'!$I$27=\"\",0,'Mål 8'!$I$27)","v":0},{"$f":"IF('Mål 8'!$J$27=\"\",0,'Mål 8'!$J$27)","v":0},{"$f":"IF('Mål 8'!$K$27=\"\",0,'Mål 8'!$K$27)","v":"00:00:00"}]
[null,null,"Mål 9",{"$f":"IF('Mål 9'!$C$8=\"\",0,'Mål 9'!$C$8)","v":0},{"$f":"IF('Mål 9'!$I$8=\"\",0,'Mål 9'!$I$8)","v":0},{"$f":"IF('Mål 9'!$J$8=\"\",0,'Mål 9'!$J$8)","v":0},{"$f":"IF('Mål 9'!$K$8=\"\",0,'Mål 9'!$K$8)","v":"00:00:00"}]
[null,null,"Mål 9",{"$f":"IF('Mål 9'!$C$9=\"\",0,'Mål 9'!$C$9)","v":0},{"$f":"IF('Mål 9'!$I$9=\"\",0,'Mål 9'!$I$9)","v":0},{"$f":"IF('Mål 9'!$J$9=\"\",0,'Mål 9'!$J$9)","v":0},{"$f":"IF('Mål 9'!$K$9=\"\",0,'Mål 9'!$K$9)","v":"00:00:00"}]
[null,null,"Mål 9",{"$f":"IF('Mål 9'!$C$10=\"\",0,'Mål 9'!$C$10)","v":0},{"$f":"IF('Mål 9'!$I$10=\"\",0,'Mål 9'!$I$10)","v":0},{"$f":"IF('Mål 9'!$J$10=\"\",0,'Mål 9'!$J$10)","v":0},{"$f":"IF('Mål 9'!$K$10=\"\",0,'Mål 9'!$K$10)","v":"00:00:00"}]
[null,null,"Mål 9",{"$f":"IF('Mål 9'!$C$11=\"\",0,'Mål 9'!$C171)","v":0},{"$f":"IF('Mål 9'!$I$11=\"\",0,'Mål 9'!$I171)","v":0},{"$f":"IF('Mål 9'!$J$11=\"\",0,'Mål 9'!$J171)","v":0},{"$f":"IF('Mål 9'!$K$11=\"\",0,'Mål 9'!$K171)","v":"00:00:00"}]
[null,null,"Mål 9",{"$f":"IF('Mål 9'!$C$12=\"\",0,'Mål 9'!$C$12)","v":0},{"$f":"IF('Mål 9'!$I$12=\"\",0,'Mål 9'!$I$12)","v":0},{"$f":"IF('Mål 9'!$J$12=\"\",0,'Mål 9'!$J$12)","v":0},{"$f":"IF('Mål 9'!$K$12=\"\",0,'Mål 9'!$K$12)","v":"00:00:00"}]
[null,null,"Mål 9",{"$f":"IF('Mål 9'!$C$13=\"\",0,'Mål 9'!$C$13)","v":0},{"$f":"IF('Mål 9'!$I$13=\"\",0,'Mål 9'!$I$13)","v":0},{"$f":"IF('Mål 9'!$J$13=\"\",0,'Mål 9'!$J$13)","v":0},{"$f":"IF('Mål 9'!$K$13=\"\",0,'Mål 9'!$K$13)","v":"00:00:00"}]
[null,null,"Mål 9",{"$f":"IF('Mål 9'!$C$14=\"\",0,'Mål 9'!$C$14)","v":0},{"$f":"IF('Mål 9'!$I$14=\"\",0,'Mål 9'!$I$14)","v":0},{"$f":"IF('Mål 9'!$J$14=\"\",0,'Mål 9'!$J$14)","v":0},{"$f":"IF('Mål 9'!$K$14=\"\",0,'Mål 9'!$K$14)","v":"00:00:00"}]
[null,null,"Mål 9",{"$f":"IF('Mål 9'!$C$15=\"\",0,'Mål 9'!$C$15)","v":0},{"$f":"IF('Mål 9'!$I$15=\"\",0,'Mål 9'!$I$15)","v":0},{"$f":"IF('Mål 9'!$J$15=\"\",0,'Mål 9'!$J$15)","v":0},{"$f":"IF('Mål 9'!$K$15=\"\",0,'Mål 9'!$K$15)","v":"00:00:00"}]
[null,null,"Mål 9",{"$f":"IF('Mål 9'!$C$16=\"\",0,'Mål 9'!$C$16)","v":0},{"$f":"IF('Mål 9'!$I$16=\"\",0,'Mål 9'!$I$16)","v":0},{"$f":"IF('Mål 9'!$J$16=\"\",0,'Mål 9'!$J$16)","v":0},{"$f":"IF('Mål 9'!$K$16=\"\",0,'Mål 9'!$K$16)","v":"00:00:00"}]
[null,null,"Mål 9",{"$f":"IF('Mål 9'!$C$17=\"\",0,'Mål 9'!$C$17)","v":0},{"$f":"IF('Mål 9'!$I$17=\"\",0,'Mål 9'!$I$17)","v":0},{"$f":"IF('Mål 9'!$J$17=\"\",0,'Mål 9'!$J$17)","v":0},{"$f":"IF('Mål 9'!$K$17=\"\",0,'Mål 9'!$K$17)","v":"00:00:00"}]
[null,null,"Mål 9",{"$f":"IF('Mål 9'!$C$18=\"\",0,'Mål 9'!$C$18)","v":0},{"$f":"IF('Mål 9'!$I$18=\"\",0,'Mål 9'!$I$18)","v":0},{"$f":"IF('Mål 9'!$J$18=\"\",0,'Mål 9'!$J$18)","v":0},{"$f":"IF('Mål 9'!$K$18=\"\",0,'Mål 9'!$K$18)","v":"00:00:00"}]
[null,null,"Mål 9",{"$f":"IF('Mål 9'!$C$19=\"\",0,'Mål 9'!$C$19)","v":0},{"$f":"IF('Mål 9'!$I$19=\"\",0,'Mål 9'!$I$19)","v":0},{"$f":"IF('Mål 9'!$J$19=\"\",0,'Mål 9'!$J$19)","v":0},{"$f":"IF('Mål 9'!$K$19=\"\",0,'Mål 9'!$K$19)","v":"00:00:00"}]
[null,null,"Mål 9",{"$f":"IF('Mål 9'!$C$20=\"\",0,'Mål 9'!$C$20)","v":0},{"$f":"IF('Mål 9'!$I$20=\"\",0,'Mål 9'!$I$20)","v":0},{"$f":"IF('Mål 9'!$J$20=\"\",0,'Mål 9'!$J$20)","v":0},{"$f":"IF('Mål 9'!$K$20=\"\",0,'Mål 9'!$K$20)","v":"00:00:00"}]
[null,null,"Mål 9",{"$f":"IF('Mål 9'!$C$21=\"\",0,'Mål 9'!$C$21)","v":0},{"$f":"IF('Mål 9'!$I$21=\"\",0,'Mål 9'!$I$21)","v":0},{"$f":"IF('Mål 9'!$J$21=\"\",0,'Mål 9'!$J$21)","v":0},{"$f":"IF('Mål 9'!$K$21=\"\",0,'Mål 9'!$K$21)","v":"00:00:00"}]
[null,null,"Mål 9",{"$f":"IF('Mål 9'!$C$22=\"\",0,'Mål 9'!$C$22)","v":0},{"$f":"IF('Mål 9'!$I$22=\"\",0,'Mål 9'!$I$22)","v":0},{"$f":"IF('Mål 9'!$J$22=\"\",0,'Mål 9'!$J$22)","v":0},{"$f":"IF('Mål 9'!$K$22=\"\",0,'Mål 9'!$K$22)","v":"00:00:00"}]
[null,null,"Mål 9",{"$f":"IF('Mål 9'!$C$23=\"\",0,'Mål 9'!$C$23)","v":0},{"$f":"IF('Mål 9'!$I$23=\"\",0,'Mål 9'!$I$23)","v":0},{"$f":"IF('Mål 9'!$J$23=\"\",0,'Mål 9'!$J$23)","v":0},{"$f":"IF('Mål 9'!$K$23=\"\",0,'Mål 9'!$K$23)","v":"00:00:00"}]
[null,null,"Mål 9",{"$f":"IF('Mål 9'!$C$24=\"\",0,'Mål 9'!$C$24)","v":0},{"$f":"IF('Mål 9'!$I$24=\"\",0,'Mål 9'!$I$24)","v":0},{"$f":"IF('Mål 9'!$J$24=\"\",0,'Mål 9'!$J$24)","v":0},{"$f":"IF('Mål 9'!$K$24=\"\",0,'Mål 9'!$K$24)","v":"00:00:00"}]
[null,null,"Mål 9",{"$f":"IF('Mål 9'!$C$25=\"\",0,'Mål 9'!$C$25)","v":0},{"$f":"IF('Mål 9'!$I$25=\"\",0,'Mål 9'!$I$25)","v":0},{"$f":"IF('Mål 9'!$J$25=\"\",0,'Mål 9'!$J$25)","v":0},{"$f":"IF('Mål 9'!$K$25=\"\",0,'Mål 9'!$K$25)","v":"00:00:00"}]
[null,null,"Mål 9",{"$f":"IF('Mål 9'!$C$26=\"\",0,'Mål 9'!$C$26)","v":0},{"$f":"IF('Mål 9'!$I$26=\"\",0,'Mål 9'!$I$26)","v":0},{"$f":"IF('Mål 9'!$J$26=\"\",0,'Mål 9'!$J$26)","v":0},{"$f":"IF('Mål 9'!$K$26=\"\",0,'Mål 9'!$K$26)","v":"00:00:00"}]
[null,null,"Mål 9",{"$f":"IF('Mål 9'!$C$27=\"\",0,'Mål 9'!$C$27)","v":0},{"$f":"IF('Mål 9'!$I$27=\"\",0,'Mål 9'!$I$27)","v":0},{"$f":"IF('Mål 9'!$J$27=\"\",0,'Mål 9'!$J$27)","v":0},{"$f":"IF('Mål 9'!$K$27=\"\",0,'Mål 9'!$K$27)","v":"00:00:00"}]
[null,null,"Mål 10",{"$f":"IF('Mål 10'!$C$8=\"\",0,'Mål 10'!$C$8)","v":0},{"$f":"IF('Mål 10'!$I$8=\"\",0,'Mål 10'!$I$8)","v":0},{"$f":"IF('Mål 10'!$J$8=\"\",0,'Mål 10'!$J$8)","v":0},{"$f":"IF('Mål 10'!$K$8=\"\",0,'Mål 10'!$K$8)","v":"00:00:00"}]
[null,null,"Mål 10",{"$f":"IF('Mål 10'!$C$9=\"\",0,'Mål 10'!$C$9)","v":0},{"$f":"IF('Mål 10'!$I$9=\"\",0,'Mål 10'!$I$9)","v":0},{"$f":"IF('Mål 10'!$J$9=\"\",0,'Mål 10'!$J$9)","v":0},{"$f":"IF('Mål 10'!$K$9=\"\",0,'Mål 10'!$K$9)","v":"00:00:00"}]
[null,null,"Mål 10",{"$f":"IF('Mål 10'!$C$10=\"\",0,'Mål 10'!$C$10)","v":0},{"$f":"IF('Mål 10'!$I$10=\"\",0,'Mål 10'!$I$10)","v":0},{"$f":"IF('Mål 10'!$J$10=\"\",0,'Mål 10'!$J$10)","v":0},{"$f":"IF('Mål 10'!$K$10=\"\",0,'Mål 10'!$K$10)","v":"00:00:00"}]
[null,null,"Mål 10",{"$f":"IF('Mål 10'!$C$11=\"\",0,'Mål 10'!$C191)","v":0},{"$f":"IF('Mål 10'!$I$11=\"\",0,'Mål 10'!$I191)","v":0},{"$f":"IF('Mål 10'!$J$11=\"\",0,'Mål 10'!$J191)","v":0},{"$f":"IF('Mål 10'!$K$11=\"\",0,'Mål 10'!$K191)","v":"00:00:00"}]
[null,null,"Mål 10",{"$f":"IF('Mål 10'!$C$12=\"\",0,'Mål 10'!$C$12)","v":0},{"$f":"IF('Mål 10'!$I$12=\"\",0,'Mål 10'!$I$12)","v":0},{"$f":"IF('Mål 10'!$J$12=\"\",0,'Mål 10'!$J$12)","v":0},{"$f":"IF('Mål 10'!$K$12=\"\",0,'Mål 10'!$K$12)","v":"00:00:00"}]
[null,null,"Mål 10",{"$f":"IF('Mål 10'!$C$13=\"\",0,'Mål 10'!$C$13)","v":0},{"$f":"IF('Mål 10'!$I$13=\"\",0,'Mål 10'!$I$13)","v":0},{"$f":"IF('Mål 10'!$J$13=\"\",0,'Mål 10'!$J$13)","v":0},{"$f":"IF('Mål 10'!$K$13=\"\",0,'Mål 10'!$K$13)","v":"00:00:00"}]
[null,null,"Mål 10",{"$f":"IF('Mål 10'!$C$14=\"\",0,'Mål 10'!$C$14)","v":0},{"$f":"IF('Mål 10'!$I$14=\"\",0,'Mål 10'!$I$14)","v":0},{"$f":"IF('Mål 10'!$J$14=\"\",0,'Mål 10'!$J$14)","v":0},{"$f":"IF('Mål 10'!$K$14=\"\",0,'Mål 10'!$K$14)","v":"00:00:00"}]
[null,null,"Mål 10",{"$f":"IF('Mål 10'!$C$15=\"\",0,'Mål 10'!$C$15)","v":0},{"$f":"IF('Mål 10'!$I$15=\"\",0,'Mål 10'!$I$15)","v":0},{"$f":"IF('Mål 10'!$J$15=\"\",0,'Mål 10'!$J$15)","v":0},{"$f":"IF('Mål 10'!$K$15=\"\",0,'Mål 10'!$K$15)","v":"00:00:00"}]
[null,null,"Mål 10",{"$f":"IF('Mål 10'!$C$16=\"\",0,'Mål 10'!$C$16)","v":0},{"$f":"IF('Mål 10'!$I$16=\"\",0,'Mål 10'!$I$16)","v":0},{"$f":"IF('Mål 10'!$J$16=\"\",0,'Mål 10'!$J$16)","v":0},{"$f":"IF('Mål 10'!$K$16=\"\",0,'Mål 10'!$K$16)","v":"00:00:00"}]
[null,null,"Mål 10",{"$f":"IF('Mål 10'!$C$17=\"\",0,'Mål 10'!$C$17)","v":0},{"$f":"IF('Mål 10'!$I$17=\"\",0,'Mål 10'!$I$17)","v":0},{"$f":"IF('Mål 10'!$J$17=\"\",0,'Mål 10'!$J$17)","v":0},{"$f":"IF('Mål 10'!$K$17=\"\",0,'Mål 10'!$K$17)","v":"00:00:00"}]
[null,null,"Mål 10",{"$f":"IF('Mål 10'!$C$18=\"\",0,'Mål 10'!$C$18)","v":0},{"$f":"IF('Mål 10'!$I$18=\"\",0,'Mål 10'!$I$18)","v":0},{"$f":"IF('Mål 10'!$J$18=\"\",0,'Mål 10'!$J$18)","v":0},{"$f":"IF('Mål 10'!$K$18=\"\",0,'Mål 10'!$K$18)","v":"00:00:00"}]
[null,null,"Mål 10",{"$f":"IF('Mål 10'!$C$19=\"\",0,'Mål 10'!$C$19)","v":0},{"$f":"IF('Mål 10'!$I$19=\"\",0,'Mål 10'!$I$19)","v":0},{"$f":"IF('Mål 10'!$J$19=\"\",0,'Mål 10'!$J$19)","v":0},{"$f":"IF('Mål 10'!$K$19=\"\",0,'Mål 10'!$K$19)","v":"00:00:00"}]
[null,null,"Mål 10",{"$f":"IF('Mål 10'!$C$20=\"\",0,'Mål 10'!$C$20)","v":0},{"$f":"IF('Mål 10'!$I$20=\"\",0,'Mål 10'!$I$20)","v":0},{"$f":"IF('Mål 10'!$J$20=\"\",0,'Mål 10'!$J$20)","v":0},{"$f":"IF('Mål 10'!$K$20=\"\",0,'Mål 10'!$K$20)","v":"00:00:00"}]
[null,null,"Mål 10",{"$f":"IF('Mål 10'!$C$21=\"\",0,'Mål 10'!$C$21)","v":0},{"$f":"IF('Mål 10'!$I$21=\"\",0,'Mål 10'!$I$21)","v":0},{"$f":"IF('Mål 10'!$J$21=\"\",0,'Mål 10'!$J$21)","v":0},{"$f":"IF('Mål 10'!$K$21=\"\",0,'Mål 10'!$K$21)","v":"00:00:00"}]
[null,null,"Mål 10",{"$f":"IF('Mål 10'!$C$22=\"\",0,'Mål 10'!$C$22)","v":0},{"$f":"IF('Mål 10'!$I$22=\"\",0,'Mål 10'!$I$22)","v":0},{"$f":"IF('Mål 10'!$J$22=\"\",0,'Mål 10'!$J$22)","v":0},{"$f":"IF('Mål 10'!$K$22=\"\",0,'Mål 10'!$K$22)","v":"00:00:00"}]
[null,null,"Mål 10",{"$f":"IF('Mål 10'!$C$23=\"\",0,'Mål 10'!$C$23)","v":0},{"$f":"IF('Mål 10'!$I$23=\"\",0,'Mål 10'!$I$23)","v":0},{"$f":"IF('Mål 10'!$J$23=\"\",0,'Mål 10'!$J$23)","v":0},{"$f":"IF('Mål 10'!$K$23=\"\",0,'Mål 10'!$K$23)","v":"00:00:00"}]
[null,null,"Mål 10",{"$f":"IF('Mål 10'!$C$24=\"\",0,'Mål 10'!$C$24)","v":0},{"$f":"IF('Mål 10'!$I$24=\"\",0,'Mål 10'!$I$24)","v":0},{"$f":"IF('Mål 10'!$J$24=\"\",0,'Mål 10'!$J$24)","v":0},{"$f":"IF('Mål 10'!$K$24=\"\",0,'Mål 10'!$K$24)","v":"00:00:00"}]
[null,null,"Mål 10",{"$f":"IF('Mål 10'!$C$25=\"\",0,'Mål 10'!$C$25)","v":0},{"$f":"IF('Mål 10'!$I$25=\"\",0,'Mål 10'!$I$25)","v":0},{"$f":"IF('Mål 10'!$J$25=\"\",0,'Mål 10'!$J$25)","v":0},{"$f":"IF('Mål 10'!$K$25=\"\",0,'Mål 10'!$K$25)","v":"00:00:00"}]
[null,null,"Mål 10",{"$f":"IF('Mål 10'!$C$26=\"\",0,'Mål 10'!$C$26)","v":0},{"$f":"IF('Mål 10'!$I$26=\"\",0,'Mål 10'!$I$26)","v":0},{"$f":"IF('Mål 10'!$J$26=\"\",0,'Mål 10'!$J$26)","v":0},{"$f":"IF('Mål 10'!$K$26=\"\",0,'Mål 10'!$K$26)","v":"00:00:00"}]
[null,null,"Mål 10",{"$f":"IF('Mål 10'!$C$27=\"\",0,'Mål 10'!$C$27)","v":0},{"$f":"IF('Mål 10'!$I$27=\"\",0,'Mål 10'!$I$27)","v":0},{"$f":"IF('Mål 10'!$J$27=\"\",0,'Mål 10'!$J$27)","v":0},{"$f":"IF('Mål 10'!$K$27=\"\",0,'Mål 10'!$K$27)","v":"00:00:00"}]
[null,null,"Mål 11",{"$f":"IF('Mål 11'!$C$8=\"\",0,'Mål 11'!$C$8)","v":0},{"$f":"IF('Mål 11'!$I$8=\"\",0,'Mål 11'!$I$8)","v":0},{"$f":"IF('Mål 11'!$J$8=\"\",0,'Mål 11'!$J$8)","v":0},{"$f":"IF('Mål 11'!$K$8=\"\",0,'Mål 11'!$K$8)","v":"00:00:00"}]
[null,null,"Mål 11",{"$f":"IF('Mål 11'!$C$9=\"\",0,'Mål 11'!$C$9)","v":0},{"$f":"IF('Mål 11'!$I$9=\"\",0,'Mål 11'!$I$9)","v":0},{"$f":"IF('Mål 11'!$J$9=\"\",0,'Mål 11'!$J$9)","v":0},{"$f":"IF('Mål 11'!$K$9=\"\",0,'Mål 11'!$K$9)","v":"00:00:00"}]
[null,null,"Mål 11",{"$f":"IF('Mål 11'!$C$10=\"\",0,'Mål 11'!$C$10)","v":0},{"$f":"IF('Mål 11'!$I$10=\"\",0,'Mål 11'!$I$10)","v":0},{"$f":"IF('Mål 11'!$J$10=\"\",0,'Mål 11'!$J$10)","v":0},{"$f":"IF('Mål 11'!$K$10=\"\",0,'Mål 11'!$K$10)","v":"00:00:00"}]
[null,null,"Mål 11",{"$f":"IF('Mål 11'!$C$11=\"\",0,'Mål 11'!$C211)","v":0},{"$f":"IF('Mål 11'!$I$11=\"\",0,'Mål 11'!$I211)","v":0},{"$f":"IF('Mål 11'!$J$11=\"\",0,'Mål 11'!$J211)","v":0},{"$f":"IF('Mål 11'!$K$11=\"\",0,'Mål 11'!$K211)","v":"00:00:00"}]
[null,null,"Mål 11",{"$f":"IF('Mål 11'!$C$12=\"\",0,'Mål 11'!$C$12)","v":0},{"$f":"IF('Mål 11'!$I$12=\"\",0,'Mål 11'!$I$12)","v":0},{"$f":"IF('Mål 11'!$J$12=\"\",0,'Mål 11'!$J$12)","v":0},{"$f":"IF('Mål 11'!$K$12=\"\",0,'Mål 11'!$K$12)","v":"00:00:00"}]
[null,null,"Mål 11",{"$f":"IF('Mål 11'!$C$13=\"\",0,'Mål 11'!$C$13)","v":0},{"$f":"IF('Mål 11'!$I$13=\"\",0,'Mål 11'!$I$13)","v":0},{"$f":"IF('Mål 11'!$J$13=\"\",0,'Mål 11'!$J$13)","v":0},{"$f":"IF('Mål 11'!$K$13=\"\",0,'Mål 11'!$K$13)","v":"00:00:00"}]
[null,null,"Mål 11",{"$f":"IF('Mål 11'!$C$14=\"\",0,'Mål 11'!$C$14)","v":0},{"$f":"IF('Mål 11'!$I$14=\"\",0,'Mål 11'!$I$14)","v":0},{"$f":"IF('Mål 11'!$J$14=\"\",0,'Mål 11'!$J$14)","v":0},{"$f":"IF('Mål 11'!$K$14=\"\",0,'Mål 11'!$K$14)","v":"00:00:00"}]
[null,null,"Mål 11",{"$f":"IF('Mål 11'!$C$15=\"\",0,'Mål 11'!$C$15)","v":0},{"$f":"IF('Mål 11'!$I$15=\"\",0,'Mål 11'!$I$15)","v":0},{"$f":"IF('Mål 11'!$J$15=\"\",0,'Mål 11'!$J$15)","v":0},{"$f":"IF('Mål 11'!$K$15=\"\",0,'Mål 11'!$K$15)","v":"00:00:00"}]
[null,null,"Mål 11",{"$f":"IF('Mål 11'!$C$16=\"\",0,'Mål 11'!$C$16)","v":0},{"$f":"IF('Mål 11'!$I$16=\"\",0,'Mål 11'!$I$16)","v":0},{"$f":"IF('Mål 11'!$J$16=\"\",0,'Mål 11'!$J$16)","v":0},{"$f":"IF('Mål 11'!$K$16=\"\",0,'Mål 11'!$K$16)","v":"00:00:00"}]
[null,null,"Mål 11",{"$f":"IF('Mål 11'!$C$17=\"\",0,'Mål 11'!$C$17)","v":0},{"$f":"IF('Mål 11'!$I$17=\"\",0,'Mål 11'!$I$17)","v":0},{"$f":"IF('Mål 11'!$J$17=\"\",0,'Mål 11'!$J$17)","v":0},{"$f":"IF('Mål 11'!$K$17=\"\",0,'Mål 11'!$K$17)","v":"00:00:00"}]
[null,null,"Mål 11",{"$f":"IF('Mål 11'!$C$18=\"\",0,'Mål 11'!$C$18)","v":0},{"$f":"IF('Mål 11'!$I$18=\"\",0,'Mål 11'!$I$18)","v":0},{"$f":"IF('Mål 11'!$J$18=\"\",0,'Mål 11'!$J$18)","v":0},{"$f":"IF('Mål 11'!$K$18=\"\",0,'Mål 11'!$K$18)","v":"00:00:00"}]
[null,null,"Mål 11",{"$f":"IF('Mål 11'!$C$19=\"\",0,'Mål 11'!$C$19)","v":0},{"$f":"IF('Mål 11'!$I$19=\"\",0,'Mål 11'!$I$19)","v":0},{"$f":"IF('Mål 11'!$J$19=\"\",0,'Mål 11'!$J$19)","v":0},{"$f":"IF('Mål 11'!$K$19=\"\",0,'Mål 11'!$K$19)","v":"00:00:00"}]
[null,null,"Mål 11",{"$f":"IF('Mål 11'!$C$20=\"\",0,'Mål 11'!$C$20)","v":0},{"$f":"IF('Mål 11'!$I$20=\"\",0,'Mål 11'!$I$20)","v":0},{"$f":"IF('Mål 11'!$J$20=\"\",0,'Mål 11'!$J$20)","v":0},{"$f":"IF('Mål 11'!$K$20=\"\",0,'Mål 11'!$K$20)","v":"00:00:00"}]
[null,null,"Mål 11",{"$f":"IF('Mål 11'!$C$21=\"\",0,'Mål 11'!$C$21)","v":0},{"$f":"IF('Mål 11'!$I$21=\"\",0,'Mål 11'!$I$21)","v":0},{"$f":"IF('Mål 11'!$J$21=\"\",0,'Mål 11'!$J$21)","v":0},{"$f":"IF('Mål 11'!$K$21=\"\",0,'Mål 11'!$K$21)","v":"00:00:00"}]
[null,null,"Mål 11",{"$f":"IF('Mål 11'!$C$22=\"\",0,'Mål 11'!$C$22)","v":0},{"$f":"IF('Mål 11'!$I$22=\"\",0,'Mål 11'!$I$22)","v":0},{"$f":"IF('Mål 11'!$J$22=\"\",0,'Mål 11'!$J$22)","v":0},{"$f":"IF('Mål 11'!$K$22=\"\",0,'Mål 11'!$K$22)","v":"00:00:00"}]
[null,null,"Mål 11",{"$f":"IF('Mål 11'!$C$23=\"\",0,'Mål 11'!$C$23)","v":0},{"$f":"IF('Mål 11'!$I$23=\"\",0,'Mål 11'!$I$23)","v":0},{"$f":"IF('Mål 11'!$J$23=\"\",0,'Mål 11'!$J$23)","v":0},{"$f":"IF('Mål 11'!$K$23=\"\",0,'Mål 11'!$K$23)","v":"00:00:00"}]
[null,null,"Mål 11",{"$f":"IF('Mål 11'!$C$24=\"\",0,'Mål 11'!$C$24)","v":0},{"$f":"IF('Mål 11'!$I$24=\"\",0,'Mål 11'!$I$24)","v":0},{"$f":"IF('Mål 11'!$J$24=\"\",0,'Mål 11'!$J$24)","v":0},{"$f":"IF('Mål 11'!$K$24=\"\",0,'Mål 11'!$K$24)","v":"00:00:00"}]
[null,null,"Mål 11",{"$f":"IF('Mål 11'!$C$25=\"\",0,'Mål 11'!$C$25)","v":0},{"$f":"IF('Mål 11'!$I$25=\"\",0,'Mål 11'!$I$25)","v":0},{"$f":"IF('Mål 11'!$J$25=\"\",0,'Mål 11'!$J$25)","v":0},{"$f":"IF('Mål 11'!$K$25=\"\",0,'Mål 11'!$K$25)","v":"00:00:00"}]
[null,null,"Mål 11",{"$f":"IF('Mål 11'!$C$26=\"\",0,'Mål 11'!$C$26)","v":0},{"$f":"IF('Mål 11'!$I$26=\"\",0,'Mål 11'!$I$26)","v":0},{"$f":"IF('Mål 11'!$J$26=\"\",0,'Mål 11'!$J$26)","v":0},{"$f":"IF('Mål 11'!$K$26=\"\",0,'Mål 11'!$K$26)","v":"00:00:00"}]
[null,null,"Mål 11",{"$f":"IF('Mål 11'!$C$27=\"\",0,'Mål 11'!$C$27)","v":0},{"$f":"IF('Mål 11'!$I$27=\"\",0,'Mål 11'!$I$27)","v":0},{"$f":"IF('Mål 11'!$J$27=\"\",0,'Mål 11'!$J$27)","v":0},{"$f":"IF('Mål 11'!$K$27=\"\",0,'Mål 11'!$K$27)","v":"00:00:00"}]
[null,null,"Mål 12",{"$f":"IF('Mål 12'!$C$8=\"\",0,'Mål 12'!$C$8)","v":0},{"$f":"IF('Mål 12'!$I$8=\"\",0,'Mål 12'!$I$8)","v":0},{"$f":"IF('Mål 12'!$J$8=\"\",0,'Mål 12'!$J$8)","v":0},{"$f":"IF('Mål 12'!$K$8=\"\",0,'Mål 12'!$K$8)","v":"00:00:00"}]
[null,null,"Mål 12",{"$f":"IF('Mål 12'!$C$9=\"\",0,'Mål 12'!$C$9)","v":0},{"$f":"IF('Mål 12'!$I$9=\"\",0,'Mål 12'!$I$9)","v":0},{"$f":"IF('Mål 12'!$J$9=\"\",0,'Mål 12'!$J$9)","v":0},{"$f":"IF('Mål 12'!$K$9=\"\",0,'Mål 12'!$K$9)","v":"00:00:00"}]
[null,null,"Mål 12",{"$f":"IF('Mål 12'!$C$10=\"\",0,'Mål 12'!$C$10)","v":0},{"$f":"IF('Mål 12'!$I$10=\"\",0,'Mål 12'!$I$10)","v":0},{"$f":"IF('Mål 12'!$J$10=\"\",0,'Mål 12'!$J$10)","v":0},{"$f":"IF('Mål 12'!$K$10=\"\",0,'Mål 12'!$K$10)","v":"00:00:00"}]
[null,null,"Mål 12",{"$f":"IF('Mål 12'!$C$11=\"\",0,'Mål 12'!$C231)","v":0},{"$f":"IF('Mål 12'!$I$11=\"\",0,'Mål 12'!$I231)","v":0},{"$f":"IF('Mål 12'!$J$11=\"\",0,'Mål 12'!$J231)","v":0},{"$f":"IF('Mål 12'!$K$11=\"\",0,'Mål 12'!$K231)","v":"00:00:00"}]
[null,null,"Mål 12",{"$f":"IF('Mål 12'!$C$12=\"\",0,'Mål 12'!$C$12)","v":0},{"$f":"IF('Mål 12'!$I$12=\"\",0,'Mål 12'!$I$12)","v":0},{"$f":"IF('Mål 12'!$J$12=\"\",0,'Mål 12'!$J$12)","v":0},{"$f":"IF('Mål 12'!$K$12=\"\",0,'Mål 12'!$K$12)","v":"00:00:00"}]
[null,null,"Mål 12",{"$f":"IF('Mål 12'!$C$13=\"\",0,'Mål 12'!$C$13)","v":0},{"$f":"IF('Mål 12'!$I$13=\"\",0,'Mål 12'!$I$13)","v":0},{"$f":"IF('Mål 12'!$J$13=\"\",0,'Mål 12'!$J$13)","v":0},{"$f":"IF('Mål 12'!$K$13=\"\",0,'Mål 12'!$K$13)","v":"00:00:00"}]
[null,null,"Mål 12",{"$f":"IF('Mål 12'!$C$14=\"\",0,'Mål 12'!$C$14)","v":0},{"$f":"IF('Mål 12'!$I$14=\"\",0,'Mål 12'!$I$14)","v":0},{"$f":"IF('Mål 12'!$J$14=\"\",0,'Mål 12'!$J$14)","v":0},{"$f":"IF('Mål 12'!$K$14=\"\",0,'Mål 12'!$K$14)","v":"00:00:00"}]
[null,null,"Mål 12",{"$f":"IF('Mål 12'!$C$15=\"\",0,'Mål 12'!$C$15)","v":0},{"$f":"IF('Mål 12'!$I$15=\"\",0,'Mål 12'!$I$15)","v":0},{"$f":"IF('Mål 12'!$J$15=\"\",0,'Mål 12'!$J$15)","v":0},{"$f":"IF('Mål 12'!$K$15=\"\",0,'Mål 12'!$K$15)","v":"00:00:00"}]
[null,null,"Mål 12",{"$f":"IF('Mål 12'!$C$16=\"\",0,'Mål 12'!$C$16)","v":0},{"$f":"IF('Mål 12'!$I$16=\"\",0,'Mål 12'!$I$16)","v":0},{"$f":"IF('Mål 12'!$J$16=\"\",0,'Mål 12'!$J$16)","v":0},{"$f":"IF('Mål 12'!$K$16=\"\",0,'Mål 12'!$K$16)","v":"00:00:00"}]
[null,null,"Mål 12",{"$f":"IF('Mål 12'!$C$17=\"\",0,'Mål 12'!$C$17)","v":0},{"$f":"IF('Mål 12'!$I$17=\"\",0,'Mål 12'!$I$17)","v":0},{"$f":"IF('Mål 12'!$J$17=\"\",0,'Mål 12'!$J$17)","v":0},{"$f":"IF('Mål 12'!$K$17=\"\",0,'Mål 12'!$K$17)","v":"00:00:00"}]
[null,null,"Mål 12",{"$f":"IF('Mål 12'!$C$18=\"\",0,'Mål 12'!$C$18)","v":0},{"$f":"IF('Mål 12'!$I$18=\"\",0,'Mål 12'!$I$18)","v":0},{"$f":"IF('Mål 12'!$J$18=\"\",0,'Mål 12'!$J$18)","v":0},{"$f":"IF('Mål 12'!$K$18=\"\",0,'Mål 12'!$K$18)","v":"00:00:00"}]
[null,null,"Mål 12",{"$f":"IF('Mål 12'!$C$19=\"\",0,'Mål 12'!$C$19)","v":0},{"$f":"IF('Mål 12'!$I$19=\"\",0,'Mål 12'!$I$19)","v":0},{"$f":"IF('Mål 12'!$J$19=\"\",0,'Mål 12'!$J$19)","v":0},{"$f":"IF('Mål 12'!$K$19=\"\",0,'Mål 12'!$K$19)","v":"00:00:00"}]
[null,null,"Mål 12",{"$f":"IF('Mål 12'!$C$20=\"\",0,'Mål 12'!$C$20)","v":0},{"$f":"IF('Mål 12'!$I$20=\"\",0,'Mål 12'!$I$20)","v":0},{"$f":"IF('Mål 12'!$J$20=\"\",0,'Mål 12'!$J$20)","v":0},{"$f":"IF('Mål 12'!$K$20=\"\",0,'Mål 12'!$K$20)","v":"00:00:00"}]
[null,null,"Mål 12",{"$f":"IF('Mål 12'!$C$21=\"\",0,'Mål 12'!$C$21)","v":0},{"$f":"IF('Mål 12'!$I$21=\"\",0,'Mål 12'!$I$21)","v":0},{"$f":"IF('Mål 12'!$J$21=\"\",0,'Mål 12'!$J$21)","v":0},{"$f":"IF('Mål 12'!$K$21=\"\",0,'Mål 12'!$K$21)","v":"00:00:00"}]
[null,null,"Mål 12",{"$f":"IF('Mål 12'!$C$22=\"\",0,'Mål 12'!$C$22)","v":0},{"$f":"IF('Mål 12'!$I$22=\"\",0,'Mål 12'!$I$22)","v":0},{"$f":"IF('Mål 12'!$J$22=\"\",0,'Mål 12'!$J$22)","v":0},{"$f":"IF('Mål 12'!$K$22=\"\",0,'Mål 12'!$K$22)","v":"00:00:00"}]
[null,null,"Mål 12",{"$f":"IF('Mål 12'!$C$23=\"\",0,'Mål 12'!$C$23)","v":0},{"$f":"IF('Mål 12'!$I$23=\"\",0,'Mål 12'!$I$23)","v":0},{"$f":"IF('Mål 12'!$J$23=\"\",0,'Mål 12'!$J$23)","v":0},{"$f":"IF('Mål 12'!$K$23=\"\",0,'Mål 12'!$K$23)","v":"00:00:00"}]
[null,null,"Mål 12",{"$f":"IF('Mål 12'!$C$24=\"\",0,'Mål 12'!$C$24)","v":0},{"$f":"IF('Mål 12'!$I$24=\"\",0,'Mål 12'!$I$24)","v":0},{"$f":"IF('Mål 12'!$J$24=\"\",0,'Mål 12'!$J$24)","v":0},{"$f":"IF('Mål 12'!$K$24=\"\",0,'Mål 12'!$K$24)","v":"00:00:00"}]
[null,null,"Mål 12",{"$f":"IF('Mål 12'!$C$25=\"\",0,'Mål 12'!$C$25)","v":0},{"$f":"IF('Mål 12'!$I$25=\"\",0,'Mål 12'!$I$25)","v":0},{"$f":"IF('Mål 12'!$J$25=\"\",0,'Mål 12'!$J$25)","v":0},{"$f":"IF('Mål 12'!$K$25=\"\",0,'Mål 12'!$K$25)","v":"00:00:00"}]
[null,null,"Mål 12",{"$f":"IF('Mål 12'!$C$26=\"\",0,'Mål 12'!$C$26)","v":0},{"$f":"IF('Mål 12'!$I$26=\"\",0,'Mål 12'!$I$26)","v":0},{"$f":"IF('Mål 12'!$J$26=\"\",0,'Mål 12'!$J$26)","v":0},{"$f":"IF('Mål 12'!$K$26=\"\",0,'Mål 12'!$K$26)","v":"00:00:00"}]
[null,null,"Mål 12",{"$f":"IF('Mål 12'!$C$27=\"\",0,'Mål 12'!$C$27)","v":0},{"$f":"IF('Mål 12'!$I$27=\"\",0,'Mål 12'!$I$27)","v":0},{"$f":"IF('Mål 12'!$J$27=\"\",0,'Mål 12'!$J$27)","v":0},{"$f":"IF('Mål 12'!$K$27=\"\",0,'Mål 12'!$K$27)","v":"00:00:00"}]
[null,null,"Mål 13",{"$f":"IF('Mål 13'!$C$8=\"\",0,'Mål 13'!$C$8)","v":0},{"$f":"IF('Mål 13'!$I$8=\"\",0,'Mål 13'!$I$8)","v":0},{"$f":"IF('Mål 13'!$J$8=\"\",0,'Mål 13'!$J$8)","v":0},{"$f":"IF('Mål 13'!$K$8=\"\",0,'Mål 13'!$K$8)","v":"00:00:00"}]
[null,null,"Mål 13",{"$f":"IF('Mål 13'!$C$9=\"\",0,'Mål 13'!$C$9)","v":0},{"$f":"IF('Mål 13'!$I$9=\"\",0,'Mål 13'!$I$9)","v":0},{"$f":"IF('Mål 13'!$J$9=\"\",0,'Mål 13'!$J$9)","v":0},{"$f":"IF('Mål 13'!$K$9=\"\",0,'Mål 13'!$K$9)","v":"00:00:00"}]
[null,null,"Mål 13",{"$f":"IF('Mål 13'!$C$10=\"\",0,'Mål 13'!$C$10)","v":0},{"$f":"IF('Mål 13'!$I$10=\"\",0,'Mål 13'!$I$10)","v":0},{"$f":"IF('Mål 13'!$J$10=\"\",0,'Mål 13'!$J$10)","v":0},{"$f":"IF('Mål 13'!$K$10=\"\",0,'Mål 13'!$K$10)","v":"00:00:00"}]
[null,null,"Mål 13",{"$f":"IF('Mål 13'!$C$11=\"\",0,'Mål 13'!$C251)","v":0},{"$f":"IF('Mål 13'!$I$11=\"\",0,'Mål 13'!$I251)","v":0},{"$f":"IF('Mål 13'!$J$11=\"\",0,'Mål 13'!$J251)","v":0},{"$f":"IF('Mål 13'!$K$11=\"\",0,'Mål 13'!$K251)","v":"00:00:00"}]
[null,null,"Mål 13",{"$f":"IF('Mål 13'!$C$12=\"\",0,'Mål 13'!$C$12)","v":0},{"$f":"IF('Mål 13'!$I$12=\"\",0,'Mål 13'!$I$12)","v":0},{"$f":"IF('Mål 13'!$J$12=\"\",0,'Mål 13'!$J$12)","v":0},{"$f":"IF('Mål 13'!$K$12=\"\",0,'Mål 13'!$K$12)","v":"00:00:00"}]
[null,null,"Mål 13",{"$f":"IF('Mål 13'!$C$13=\"\",0,'Mål 13'!$C$13)","v":0},{"$f":"IF('Mål 13'!$I$13=\"\",0,'Mål 13'!$I$13)","v":0},{"$f":"IF('Mål 13'!$J$13=\"\",0,'Mål 13'!$J$13)","v":0},{"$f":"IF('Mål 13'!$K$13=\"\",0,'Mål 13'!$K$13)","v":"00:00:00"}]
[null,null,"Mål 13",{"$f":"IF('Mål 13'!$C$14=\"\",0,'Mål 13'!$C$14)","v":0},{"$f":"IF('Mål 13'!$I$14=\"\",0,'Mål 13'!$I$14)","v":0},{"$f":"IF('Mål 13'!$J$14=\"\",0,'Mål 13'!$J$14)","v":0},{"$f":"IF('Mål 13'!$K$14=\"\",0,'Mål 13'!$K$14)","v":"00:00:00"}]
[null,null,"Mål 13",{"$f":"IF('Mål 13'!$C$15=\"\",0,'Mål 13'!$C$15)","v":0},{"$f":"IF('Mål 13'!$I$15=\"\",0,'Mål 13'!$I$15)","v":0},{"$f":"IF('Mål 13'!$J$15=\"\",0,'Mål 13'!$J$15)","v":0},{"$f":"IF('Mål 13'!$K$15=\"\",0,'Mål 13'!$K$15)","v":"00:00:00"}]
[null,null,"Mål 13",{"$f":"IF('Mål 13'!$C$16=\"\",0,'Mål 13'!$C$16)","v":0},{"$f":"IF('Mål 13'!$I$16=\"\",0,'Mål 13'!$I$16)","v":0},{"$f":"IF('Mål 13'!$J$16=\"\",0,'Mål 13'!$J$16)","v":0},{"$f":"IF('Mål 13'!$K$16=\"\",0,'Mål 13'!$K$16)","v":"00:00:00"}]
[null,null,"Mål 13",{"$f":"IF('Mål 13'!$C$17=\"\",0,'Mål 13'!$C$17)","v":0},{"$f":"IF('Mål 13'!$I$17=\"\",0,'Mål 13'!$I$17)","v":0},{"$f":"IF('Mål 13'!$J$17=\"\",0,'Mål 13'!$J$17)","v":0},{"$f":"IF('Mål 13'!$K$17=\"\",0,'Mål 13'!$K$17)","v":"00:00:00"}]
[null,null,"Mål 13",{"$f":"IF('Mål 13'!$C$18=\"\",0,'Mål 13'!$C$18)","v":0},{"$f":"IF('Mål 13'!$I$18=\"\",0,'Mål 13'!$I$18)","v":0},{"$f":"IF('Mål 13'!$J$18=\"\",0,'Mål 13'!$J$18)","v":0},{"$f":"IF('Mål 13'!$K$18=\"\",0,'Mål 13'!$K$18)","v":"00:00:00"}]
[null,null,"Mål 13",{"$f":"IF('Mål 13'!$C$19=\"\",0,'Mål 13'!$C$19)","v":0},{"$f":"IF('Mål 13'!$I$19=\"\",0,'Mål 13'!$I$19)","v":0},{"$f":"IF('Mål 13'!$J$19=\"\",0,'Mål 13'!$J$19)","v":0},{"$f":"IF('Mål 13'!$K$19=\"\",0,'Mål 13'!$K$19)","v":"00:00:00"}]
[null,null,"Mål 13",{"$f":"IF('Mål 13'!$C$20=\"\",0,'Mål 13'!$C$20)","v":0},{"$f":"IF('Mål 13'!$I$20=\"\",0,'Mål 13'!$I$20)","v":0},{"$f":"IF('Mål 13'!$J$20=\"\",0,'Mål 13'!$J$20)","v":0},{"$f":"IF('Mål 13'!$K$20=\"\",0,'Mål 13'!$K$20)","v":"00:00:00"}]
[null,null,"Mål 13",{"$f":"IF('Mål 13'!$C$21=\"\",0,'Mål 13'!$C$21)","v":0},{"$f":"IF('Mål 13'!$I$21=\"\",0,'Mål 13'!$I$21)","v":0},{"$f":"IF('Mål 13'!$J$21=\"\",0,'Mål 13'!$J$21)","v":0},{"$f":"IF('Mål 13'!$K$21=\"\",0,'Mål 13'!$K$21)","v":"00:00:00"}]
[null,null,"Mål 13",{"$f":"IF('Mål 13'!$C$22=\"\",0,'Mål 13'!$C$22)","v":0},{"$f":"IF('Mål 13'!$I$22=\"\",0,'Mål 13'!$I$22)","v":0},{"$f":"IF('Mål 13'!$J$22=\"\",0,'Mål 13'!$J$22)","v":0},{"$f":"IF('Mål 13'!$K$22=\"\",0,'Mål 13'!$K$22)","v":"00:00:00"}]
[null,null,"Mål 13",{"$f":"IF('Mål 13'!$C$23=\"\",0,'Mål 13'!$C$23)","v":0},{"$f":"IF('Mål 13'!$I$23=\"\",0,'Mål 13'!$I$23)","v":0},{"$f":"IF('Mål 13'!$J$23=\"\",0,'Mål 13'!$J$23)","v":0},{"$f":"IF('Mål 13'!$K$23=\"\",0,'Mål 13'!$K$23)","v":"00:00:00"}]
[null,null,"Mål 13",{"$f":"IF('Mål 13'!$C$24=\"\",0,'Mål 13'!$C$24)","v":0},{"$f":"IF('Mål 13'!$I$24=\"\",0,'Mål 13'!$I$24)","v":0},{"$f":"IF('Mål 13'!$J$24=\"\",0,'Mål 13'!$J$24)","v":0},{"$f":"IF('Mål 13'!$K$24=\"\",0,'Mål 13'!$K$24)","v":"00:00:00"}]
[null,null,"Mål 13",{"$f":"IF('Mål 13'!$C$25=\"\",0,'Mål 13'!$C$25)","v":0},{"$f":"IF('Mål 13'!$I$25=\"\",0,'Mål 13'!$I$25)","v":0},{"$f":"IF('Mål 13'!$J$25=\"\",0,'Mål 13'!$J$25)","v":0},{"$f":"IF('Mål 13'!$K$25=\"\",0,'Mål 13'!$K$25)","v":"00:00:00"}]
[null,null,"Mål 13",{"$f":"IF('Mål 13'!$C$26=\"\",0,'Mål 13'!$C$26)","v":0},{"$f":"IF('Mål 13'!$I$26=\"\",0,'Mål 13'!$I$26)","v":0},{"$f":"IF('Mål 13'!$J$26=\"\",0,'Mål 13'!$J$26)","v":0},{"$f":"IF('Mål 13'!$K$26=\"\",0,'Mål 13'!$K$26)","v":"00:00:00"}]
[null,null,"Mål 13",{"$f":"IF('Mål 13'!$C$27=\"\",0,'Mål 13'!$C$27)","v":0},{"$f":"IF('Mål 13'!$I$27=\"\",0,'Mål 13'!$I$27)","v":0},{"$f":"IF('Mål 13'!$J$27=\"\",0,'Mål 13'!$J$27)","v":0},{"$f":"IF('Mål 13'!$K$27=\"\",0,'Mål 13'!$K$27)","v":"00:00:00"}]
[null,null,"Mål 14",{"$f":"IF('Mål 14'!$C$8=\"\",0,'Mål 14'!$C$8)","v":0},{"$f":"IF('Mål 14'!$I$8=\"\",0,'Mål 14'!$I$8)","v":0},{"$f":"IF('Mål 14'!$J$8=\"\",0,'Mål 14'!$J$8)","v":0},{"$f":"IF('Mål 14'!$K$8=\"\",0,'Mål 14'!$K$8)","v":"00:00:00"}]
[null,null,"Mål 14",{"$f":"IF('Mål 14'!$C$9=\"\",0,'Mål 14'!$C$9)","v":0},{"$f":"IF('Mål 14'!$I$9=\"\",0,'Mål 14'!$I$9)","v":0},{"$f":"IF('Mål 14'!$J$9=\"\",0,'Mål 14'!$J$9)","v":0},{"$f":"IF('Mål 14'!$K$9=\"\",0,'Mål 14'!$K$9)","v":"00:00:00"}]
[null,null,"Mål 14",{"$f":"IF('Mål 14'!$C$10=\"\",0,'Mål 14'!$C$10)","v":0},{"$f":"IF('Mål 14'!$I$10=\"\",0,'Mål 14'!$I$10)","v":0},{"$f":"IF('Mål 14'!$J$10=\"\",0,'Mål 14'!$J$10)","v":0},{"$f":"IF('Mål 14'!$K$10=\"\",0,'Mål 14'!$K$10)","v":"00:00:00"}]
[null,null,"Mål 14",{"$f":"IF('Mål 14'!$C$11=\"\",0,'Mål 14'!$C271)","v":0},{"$f":"IF('Mål 14'!$I$11=\"\",0,'Mål 14'!$I271)","v":0},{"$f":"IF('Mål 14'!$J$11=\"\",0,'Mål 14'!$J271)","v":0},{"$f":"IF('Mål 14'!$K$11=\"\",0,'Mål 14'!$K271)","v":"00:00:00"}]
[null,null,"Mål 14",{"$f":"IF('Mål 14'!$C$12=\"\",0,'Mål 14'!$C$12)","v":0},{"$f":"IF('Mål 14'!$I$12=\"\",0,'Mål 14'!$I$12)","v":0},{"$f":"IF('Mål 14'!$J$12=\"\",0,'Mål 14'!$J$12)","v":0},{"$f":"IF('Mål 14'!$K$12=\"\",0,'Mål 14'!$K$12)","v":"00:00:00"}]
[null,null,"Mål 14",{"$f":"IF('Mål 14'!$C$13=\"\",0,'Mål 14'!$C$13)","v":0},{"$f":"IF('Mål 14'!$I$13=\"\",0,'Mål 14'!$I$13)","v":0},{"$f":"IF('Mål 14'!$J$13=\"\",0,'Mål 14'!$J$13)","v":0},{"$f":"IF('Mål 14'!$K$13=\"\",0,'Mål 14'!$K$13)","v":"00:00:00"}]
[null,null,"Mål 14",{"$f":"IF('Mål 14'!$C$14=\"\",0,'Mål 14'!$C$14)","v":0},{"$f":"IF('Mål 14'!$I$14=\"\",0,'Mål 14'!$I$14)","v":0},{"$f":"IF('Mål 14'!$J$14=\"\",0,'Mål 14'!$J$14)","v":0},{"$f":"IF('Mål 14'!$K$14=\"\",0,'Mål 14'!$K$14)","v":"00:00:00"}]
[null,null,"Mål 14",{"$f":"IF('Mål 14'!$C$15=\"\",0,'Mål 14'!$C$15)","v":0},{"$f":"IF('Mål 14'!$I$15=\"\",0,'Mål 14'!$I$15)","v":0},{"$f":"IF('Mål 14'!$J$15=\"\",0,'Mål 14'!$J$15)","v":0},{"$f":"IF('Mål 14'!$K$15=\"\",0,'Mål 14'!$K$15)","v":"00:00:00"}]
[null,null,"Mål 14",{"$f":"IF('Mål 14'!$C$16=\"\",0,'Mål 14'!$C$16)","v":0},{"$f":"IF('Mål 14'!$I$16=\"\",0,'Mål 14'!$I$16)","v":0},{"$f":"IF('Mål 14'!$J$16=\"\",0,'Mål 14'!$J$16)","v":0},{"$f":"IF('Mål 14'!$K$16=\"\",0,'Mål 14'!$K$16)","v":"00:00:00"}]
[null,null,"Mål 14",{"$f":"IF('Mål 14'!$C$17=\"\",0,'Mål 14'!$C$17)","v":0},{"$f":"IF('Mål 14'!$I$17=\"\",0,'Mål 14'!$I$17)","v":0},{"$f":"IF('Mål 14'!$J$17=\"\",0,'Mål 14'!$J$17)","v":0},{"$f":"IF('Mål 14'!$K$17=\"\",0,'Mål 14'!$K$17)","v":"00:00:00"}]
[null,null,"Mål 14",{"$f":"IF('Mål 14'!$C$18=\"\",0,'Mål 14'!$C$18)","v":0},{"$f":"IF('Mål 14'!$I$18=\"\",0,'Mål 14'!$I$18)","v":0},{"$f":"IF('Mål 14'!$J$18=\"\",0,'Mål 14'!$J$18)","v":0},{"$f":"IF('Mål 14'!$K$18=\"\",0,'Mål 14'!$K$18)","v":"00:00:00"}]
[null,null,"Mål 14",{"$f":"IF('Mål 14'!$C$19=\"\",0,'Mål 14'!$C$19)","v":0},{"$f":"IF('Mål 14'!$I$19=\"\",0,'Mål 14'!$I$19)","v":0},{"$f":"IF('Mål 14'!$J$19=\"\",0,'Mål 14'!$J$19)","v":0},{"$f":"IF('Mål 14'!$K$19=\"\",0,'Mål 14'!$K$19)","v":"00:00:00"}]
[null,null,"Mål 14",{"$f":"IF('Mål 14'!$C$20=\"\",0,'Mål 14'!$C$20)","v":0},{"$f":"IF('Mål 14'!$I$20=\"\",0,'Mål 14'!$I$20)","v":0},{"$f":"IF('Mål 14'!$J$20=\"\",0,'Mål 14'!$J$20)","v":0},{"$f":"IF('Mål 14'!$K$20=\"\",0,'Mål 14'!$K$20)","v":"00:00:00"}]
[null,null,"Mål 14",{"$f":"IF('Mål 14'!$C$21=\"\",0,'Mål 14'!$C$21)","v":0},{"$f":"IF('Mål 14'!$I$21=\"\",0,'Mål 14'!$I$21)","v":0},{"$f":"IF('Mål 14'!$J$21=\"\",0,'Mål 14'!$J$21)","v":0},{"$f":"IF('Mål 14'!$K$21=\"\",0,'Mål 14'!$K$21)","v":"00:00:00"}]
[null,null,"Mål 14",{"$f":"IF('Mål 14'!$C$22=\"\",0,'Mål 14'!$C$22)","v":0},{"$f":"IF('Mål 14'!$I$22=\"\",0,'Mål 14'!$I$22)","v":0},{"$f":"IF('Mål 14'!$J$22=\"\",0,'Mål 14'!$J$22)","v":0},{"$f":"IF('Mål 14'!$K$22=\"\",0,'Mål 14'!$K$22)","v":"00:00:00"}]
[null,null,"Mål 14",{"$f":"IF('Mål 14'!$C$23=\"\",0,'Mål 14'!$C$23)","v":0},{"$f":"IF('Mål 14'!$I$23=\"\",0,'Mål 14'!$I$23)","v":0},{"$f":"IF('Mål 14'!$J$23=\"\",0,'Mål 14'!$J$23)","v":0},{"$f":"IF('Mål 14'!$K$23=\"\",0,'Mål 14'!$K$23)","v":"00:00:00"}]
[null,null,"Mål 14",{"$f":"IF('Mål 14'!$C$24=\"\",0,'Mål 14'!$C$24)","v":0},{"$f":"IF('Mål 14'!$I$24=\"\",0,'Mål 14'!$I$24)","v":0},{"$f":"IF('Mål 14'!$J$24=\"\",0,'Mål 14'!$J$24)","v":0},{"$f":"IF('Mål 14'!$K$24=\"\",0,'Mål 14'!$K$24)","v":"00:00:00"}]
[null,null,"Mål 14",{"$f":"IF('Mål 14'!$C$25=\"\",0,'Mål 14'!$C$25)","v":0},{"$f":"IF('Mål 14'!$I$25=\"\",0,'Mål 14'!$I$25)","v":0},{"$f":"IF('Mål 14'!$J$25=\"\",0,'Mål 14'!$J$25)","v":0},{"$f":"IF('Mål 14'!$K$25=\"\",0,'Mål 14'!$K$25)","v":"00:00:00"}]
[null,null,"Mål 14",{"$f":"IF('Mål 14'!$C$26=\"\",0,'Mål 14'!$C$26)","v":0},{"$f":"IF('Mål 14'!$I$26=\"\",0,'Mål 14'!$I$26)","v":0},{"$f":"IF('Mål 14'!$J$26=\"\",0,'Mål 14'!$J$26)","v":0},{"$f":"IF('Mål 14'!$K$26=\"\",0,'Mål 14'!$K$26)","v":"00:00:00"}]
[null,null,"Mål 14",{"$f":"IF('Mål 14'!$C$27=\"\",0,'Mål 14'!$C$27)","v":0},{"$f":"IF('Mål 14'!$I$27=\"\",0,'Mål 14'!$I$27)","v":0},{"$f":"IF('Mål 14'!$J$27=\"\",0,'Mål 14'!$J$27)","v":0},{"$f":"IF('Mål 14'!$K$27=\"\",0,'Mål 14'!$K$27)","v":"00:00:00"}]
[null,null,"Mål 15",{"$f":"IF('Mål 15'!$C$8=\"\",0,'Mål 15'!$C$8)","v":0},{"$f":"IF('Mål 15'!$I$8=\"\",0,'Mål 15'!$I$8)","v":0},{"$f":"IF('Mål 15'!$J$8=\"\",0,'Mål 15'!$J$8)","v":0},{"$f":"IF('Mål 15'!$K$8=\"\",0,'Mål 15'!$K$8)","v":"00:00:00"}]
[null,null,"Mål 15",{"$f":"IF('Mål 15'!$C$9=\"\",0,'Mål 15'!$C$9)","v":0},{"$f":"IF('Mål 15'!$I$9=\"\",0,'Mål 15'!$I$9)","v":0},{"$f":"IF('Mål 15'!$J$9=\"\",0,'Mål 15'!$J$9)","v":0},{"$f":"IF('Mål 15'!$K$9=\"\",0,'Mål 15'!$K$9)","v":"00:00:00"}]
[null,null,"Mål 15",{"$f":"IF('Mål 15'!$C$10=\"\",0,'Mål 15'!$C$10)","v":0},{"$f":"IF('Mål 15'!$I$10=\"\",0,'Mål 15'!$I$10)","v":0},{"$f":"IF('Mål 15'!$J$10=\"\",0,'Mål 15'!$J$10)","v":0},{"$f":"IF('Mål 15'!$K$10=\"\",0,'Mål 15'!$K$10)","v":"00:00:00"}]
[null,null,"Mål 15",{"$f":"IF('Mål 15'!$C$11=\"\",0,'Mål 15'!$C291)","v":0},{"$f":"IF('Mål 15'!$I$11=\"\",0,'Mål 15'!$I291)","v":0},{"$f":"IF('Mål 15'!$J$11=\"\",0,'Mål 15'!$J291)","v":0},{"$f":"IF('Mål 15'!$K$11=\"\",0,'Mål 15'!$K291)","v":"00:00:00"}]
[null,null,"Mål 15",{"$f":"IF('Mål 15'!$C$12=\"\",0,'Mål 15'!$C$12)","v":0},{"$f":"IF('Mål 15'!$I$12=\"\",0,'Mål 15'!$I$12)","v":0},{"$f":"IF('Mål 15'!$J$12=\"\",0,'Mål 15'!$J$12)","v":0},{"$f":"IF('Mål 15'!$K$12=\"\",0,'Mål 15'!$K$12)","v":"00:00:00"}]
[null,null,"Mål 15",{"$f":"IF('Mål 15'!$C$13=\"\",0,'Mål 15'!$C$13)","v":0},{"$f":"IF('Mål 15'!$I$13=\"\",0,'Mål 15'!$I$13)","v":0},{"$f":"IF('Mål 15'!$J$13=\"\",0,'Mål 15'!$J$13)","v":0},{"$f":"IF('Mål 15'!$K$13=\"\",0,'Mål 15'!$K$13)","v":"00:00:00"}]
[null,null,"Mål 15",{"$f":"IF('Mål 15'!$C$14=\"\",0,'Mål 15'!$C$14)","v":0},{"$f":"IF('Mål 15'!$I$14=\"\",0,'Mål 15'!$I$14)","v":0},{"$f":"IF('Mål 15'!$J$14=\"\",0,'Mål 15'!$J$14)","v":0},{"$f":"IF('Mål 15'!$K$14=\"\",0,'Mål 15'!$K$14)","v":"00:00:00"}]
[null,null,"Mål 15",{"$f":"IF('Mål 15'!$C$15=\"\",0,'Mål 15'!$C$15)","v":0},{"$f":"IF('Mål 15'!$I$15=\"\",0,'Mål 15'!$I$15)","v":0},{"$f":"IF('Mål 15'!$J$15=\"\",0,'Mål 15'!$J$15)","v":0},{"$f":"IF('Mål 15'!$K$15=\"\",0,'Mål 15'!$K$15)","v":"00:00:00"}]
[null,null,"Mål 15",{"$f":"IF('Mål 15'!$C$16=\"\",0,'Mål 15'!$C$16)","v":0},{"$f":"IF('Mål 15'!$I$16=\"\",0,'Mål 15'!$I$16)","v":0},{"$f":"IF('Mål 15'!$J$16=\"\",0,'Mål 15'!$J$16)","v":0},{"$f":"IF('Mål 15'!$K$16=\"\",0,'Mål 15'!$K$16)","v":"00:00:00"}]
[null,null,"Mål 15",{"$f":"IF('Mål 15'!$C$17=\"\",0,'Mål 15'!$C$17)","v":0},{"$f":"IF('Mål 15'!$I$17=\"\",0,'Mål 15'!$I$17)","v":0},{"$f":"IF('Mål 15'!$J$17=\"\",0,'Mål 15'!$J$17)","v":0},{"$f":"IF('Mål 15'!$K$17=\"\",0,'Mål 15'!$K$17)","v":"00:00:00"}]
[null,null,"Mål 15",{"$f":"IF('Mål 15'!$C$18=\"\",0,'Mål 15'!$C$18)","v":0},{"$f":"IF('Mål 15'!$I$18=\"\",0,'Mål 15'!$I$18)","v":0},{"$f":"IF('Mål 15'!$J$18=\"\",0,'Mål 15'!$J$18)","v":0},{"$f":"IF('Mål 15'!$K$18=\"\",0,'Mål 15'!$K$18)","v":"00:00:00"}]
[null,null,"Mål 15",{"$f":"IF('Mål 15'!$C$19=\"\",0,'Mål 15'!$C$19)","v":0},{"$f":"IF('Mål 15'!$I$19=\"\",0,'Mål 15'!$I$19)","v":0},{"$f":"IF('Mål 15'!$J$19=\"\",0,'Mål 15'!$J$19)","v":0},{"$f":"IF('Mål 15'!$K$19=\"\",0,'Mål 15'!$K$19)","v":"00:00:00"}]
[null,null,"Mål 15",{"$f":"IF('Mål 15'!$C$20=\"\",0,'Mål 15'!$C$20)","v":0},{"$f":"IF('Mål 15'!$I$20=\"\",0,'Mål 15'!$I$20)","v":0},{"$f":"IF('Mål 15'!$J$20=\"\",0,'Mål 15'!$J$20)","v":0},{"$f":"IF('Mål 15'!$K$20=\"\",0,'Mål 15'!$K$20)","v":"00:00:00"}]
[null,null,"Mål 15",{"$f":"IF('Mål 15'!$C$21=\"\",0,'Mål 15'!$C$21)","v":0},{"$f":"IF('Mål 15'!$I$21=\"\",0,'Mål 15'!$I$21)","v":0},{"$f":"IF('Mål 15'!$J$21=\"\",0,'Mål 15'!$J$21)","v":0},{"$f":"IF('Mål 15'!$K$21=\"\",0,'Mål 15'!$K$21)","v":"00:00:00"}]
[null,null,"Mål 15",{"$f":"IF('Mål 15'!$C$22=\"\",0,'Mål 15'!$C$22)","v":0},{"$f":"IF('Mål 15'!$I$22=\"\",0,'Mål 15'!$I$22)","v":0},{"$f":"IF('Mål 15'!$J$22=\"\",0,'Mål 15'!$J$22)","v":0},{"$f":"IF('Mål 15'!$K$22=\"\",0,'Mål 15'!$K$22)","v":"00:00:00"}]
[null,null,"Mål 15",{"$f":"IF('Mål 15'!$C$23=\"\",0,'Mål 15'!$C$23)","v":0},{"$f":"IF('Mål 15'!$I$23=\"\",0,'Mål 15'!$I$23)","v":0},{"$f":"IF('Mål 15'!$J$23=\"\",0,'Mål 15'!$J$23)","v":0},{"$f":"IF('Mål 15'!$K$23=\"\",0,'Mål 15'!$K$23)","v":"00:00:00"}]
[null,null,"Mål 15",{"$f":"IF('Mål 15'!$C$24=\"\",0,'Mål 15'!$C$24)","v":0},{"$f":"IF('Mål 15'!$I$24=\"\",0,'Mål 15'!$I$24)","v":0},{"$f":"IF('Mål 15'!$J$24=\"\",0,'Mål 15'!$J$24)","v":0},{"$f":"IF('Mål 15'!$K$24=\"\",0,'Mål 15'!$K$24)","v":"00:00:00"}]
[null,null,"Mål 15",{"$f":"IF('Mål 15'!$C$25=\"\",0,'Mål 15'!$C$25)","v":0},{"$f":"IF('Mål 15'!$I$25=\"\",0,'Mål 15'!$I$25)","v":0},{"$f":"IF('Mål 15'!$J$25=\"\",0,'Mål 15'!$J$25)","v":0},{"$f":"IF('Mål 15'!$K$25=\"\",0,'Mål 15'!$K$25)","v":"00:00:00"}]
[null,null,"Mål 15",{"$f":"IF('Mål 15'!$C$26=\"\",0,'Mål 15'!$C$26)","v":0},{"$f":"IF('Mål 15'!$I$26=\"\",0,'Mål 15'!$I$26)","v":0},{"$f":"IF('Mål 15'!$J$26=\"\",0,'Mål 15'!$J$26)","v":0},{"$f":"IF('Mål 15'!$K$26=\"\",0,'Mål 15'!$K$26)","v":"00:00:00"}]
[null,null,"Mål 15",{"$f":"IF('Mål 15'!$C$27=\"\",0,'Mål 15'!$C$27)","v":0},{"$f":"IF('Mål 15'!$I$27=\"\",0,'Mål 15'!$I$27)","v":0},{"$f":"IF('Mål 15'!$J$27=\"\",0,'Mål 15'!$J$27)","v":0},{"$f":"IF('Mål 15'!$K$27=\"\",0,'Mål 15'!$K$27)","v":"00:00:00"}]
[null,null,"Mål 16",{"$f":"IF('Mål 16'!$C$8=\"\",0,'Mål 16'!$C$8)","v":0},{"$f":"IF('Mål 16'!$I$8=\"\",0,'Mål 16'!$I$8)","v":0},{"$f":"IF('Mål 16'!$J$8=\"\",0,'Mål 16'!$J$8)","v":0},{"$f":"IF('Mål 16'!$K$8=\"\",0,'Mål 16'!$K$8)","v":"00:00:00"}]
[null,null,"Mål 16",{"$f":"IF('Mål 16'!$C$9=\"\",0,'Mål 16'!$C$9)","v":0},{"$f":"IF('Mål 16'!$I$9=\"\",0,'Mål 16'!$I$9)","v":0},{"$f":"IF('Mål 16'!$J$9=\"\",0,'Mål 16'!$J$9)","v":0},{"$f":"IF('Mål 16'!$K$9=\"\",0,'Mål 16'!$K$9)","v":"00:00:00"}]
[null,null,"Mål 16",{"$f":"IF('Mål 16'!$C$10=\"\",0,'Mål 16'!$C$10)","v":0},{"$f":"IF('Mål 16'!$I$10=\"\",0,'Mål 16'!$I$10)","v":0},{"$f":"IF('Mål 16'!$J$10=\"\",0,'Mål 16'!$J$10)","v":0},{"$f":"IF('Mål 16'!$K$10=\"\",0,'Mål 16'!$K$10)","v":"00:00:00"}]
[null,null,"Mål 16",{"$f":"IF('Mål 16'!$C$11=\"\",0,'Mål 16'!$C311)","v":0},{"$f":"IF('Mål 16'!$I$11=\"\",0,'Mål 16'!$I311)","v":0},{"$f":"IF('Mål 16'!$J$11=\"\",0,'Mål 16'!$J311)","v":0},{"$f":"IF('Mål 16'!$K$11=\"\",0,'Mål 16'!$K311)","v":"00:00:00"}]
[null,null,"Mål 16",{"$f":"IF('Mål 16'!$C$12=\"\",0,'Mål 16'!$C$12)","v":0},{"$f":"IF('Mål 16'!$I$12=\"\",0,'Mål 16'!$I$12)","v":0},{"$f":"IF('Mål 16'!$J$12=\"\",0,'Mål 16'!$J$12)","v":0},{"$f":"IF('Mål 16'!$K$12=\"\",0,'Mål 16'!$K$12)","v":"00:00:00"}]
[null,null,"Mål 16",{"$f":"IF('Mål 16'!$C$13=\"\",0,'Mål 16'!$C$13)","v":0},{"$f":"IF('Mål 16'!$I$13=\"\",0,'Mål 16'!$I$13)","v":0},{"$f":"IF('Mål 16'!$J$13=\"\",0,'Mål 16'!$J$13)","v":0},{"$f":"IF('Mål 16'!$K$13=\"\",0,'Mål 16'!$K$13)","v":"00:00:00"}]
[null,null,"Mål 16",{"$f":"IF('Mål 16'!$C$14=\"\",0,'Mål 16'!$C$14)","v":0},{"$f":"IF('Mål 16'!$I$14=\"\",0,'Mål 16'!$I$14)","v":0},{"$f":"IF('Mål 16'!$J$14=\"\",0,'Mål 16'!$J$14)","v":0},{"$f":"IF('Mål 16'!$K$14=\"\",0,'Mål 16'!$K$14)","v":"00:00:00"}]
[null,null,"Mål 16",{"$f":"IF('Mål 16'!$C$15=\"\",0,'Mål 16'!$C$15)","v":0},{"$f":"IF('Mål 16'!$I$15=\"\",0,'Mål 16'!$I$15)","v":0},{"$f":"IF('Mål 16'!$J$15=\"\",0,'Mål 16'!$J$15)","v":0},{"$f":"IF('Mål 16'!$K$15=\"\",0,'Mål 16'!$K$15)","v":"00:00:00"}]
[null,null,"Mål 16",{"$f":"IF('Mål 16'!$C$16=\"\",0,'Mål 16'!$C$16)","v":0},{"$f":"IF('Mål 16'!$I$16=\"\",0,'Mål 16'!$I$16)","v":0},{"$f":"IF('Mål 16'!$J$16=\"\",0,'Mål 16'!$J$16)","v":0},{"$f":"IF('Mål 16'!$K$16=\"\",0,'Mål 16'!$K$16)","v":"00:00:00"}]
[null,null,"Mål 16",{"$f":"IF('Mål 16'!$C$17=\"\",0,'Mål 16'!$C$17)","v":0},{"$f":"IF('Mål 16'!$I$17=\"\",0,'Mål 16'!$I$17)","v":0},{"$f":"IF('Mål 16'!$J$17=\"\",0,'Mål 16'!$J$17)","v":0},{"$f":"IF('Mål 16'!$K$17=\"\",0,'Mål 16'!$K$17)","v":"00:00:00"}]
[null,null,"Mål 16",{"$f":"IF('Mål 16'!$C$18=\"\",0,'Mål 16'!$C$18)","v":0},{"$f":"IF('Mål 16'!$I$18=\"\",0,'Mål 16'!$I$18)","v":0},{"$f":"IF('Mål 16'!$J$18=\"\",0,'Mål 16'!$J$18)","v":0},{"$f":"IF('Mål 16'!$K$18=\"\",0,'Mål 16'!$K$18)","v":"00:00:00"}]
[null,null,"Mål 16",{"$f":"IF('Mål 16'!$C$19=\"\",0,'Mål 16'!$C$19)","v":0},{"$f":"IF('Mål 16'!$I$19=\"\",0,'Mål 16'!$I$19)","v":0},{"$f":"IF('Mål 16'!$J$19=\"\",0,'Mål 16'!$J$19)","v":0},{"$f":"IF('Mål 16'!$K$19=\"\",0,'Mål 16'!$K$19)","v":"00:00:00"}]
[null,null,"Mål 16",{"$f":"IF('Mål 16'!$C$20=\"\",0,'Mål 16'!$C$20)","v":0},{"$f":"IF('Mål 16'!$I$20=\"\",0,'Mål 16'!$I$20)","v":0},{"$f":"IF('Mål 16'!$J$20=\"\",0,'Mål 16'!$J$20)","v":0},{"$f":"IF('Mål 16'!$K$20=\"\",0,'Mål 16'!$K$20)","v":"00:00:00"}]
[null,null,"Mål 16",{"$f":"IF('Mål 16'!$C$21=\"\",0,'Mål 16'!$C$21)","v":0},{"$f":"IF('Mål 16'!$I$21=\"\",0,'Mål 16'!$I$21)","v":0},{"$f":"IF('Mål 16'!$J$21=\"\",0,'Mål 16'!$J$21)","v":0},{"$f":"IF('Mål 16'!$K$21=\"\",0,'Mål 16'!$K$21)","v":"00:00:00"}]
[null,null,"Mål 16",{"$f":"IF('Mål 16'!$C$22=\"\",0,'Mål 16'!$C$22)","v":0},{"$f":"IF('Mål 16'!$I$22=\"\",0,'Mål 16'!$I$22)","v":0},{"$f":"IF('Mål 16'!$J$22=\"\",0,'Mål 16'!$J$22)","v":0},{"$f":"IF('Mål 16'!$K$22=\"\",0,'Mål 16'!$K$22)","v":"00:00:00"}]
[null,null,"Mål 16",{"$f":"IF('Mål 16'!$C$23=\"\",0,'Mål 16'!$C$23)","v":0},{"$f":"IF('Mål 16'!$I$23=\"\",0,'Mål 16'!$I$23)","v":0},{"$f":"IF('Mål 16'!$J$23=\"\",0,'Mål 16'!$J$23)","v":0},{"$f":"IF('Mål 16'!$K$23=\"\",0,'Mål 16'!$K$23)","v":"00:00:00"}]
[null,null,"Mål 16",{"$f":"IF('Mål 16'!$C$24=\"\",0,'Mål 16'!$C$24)","v":0},{"$f":"IF('Mål 16'!$I$24=\"\",0,'Mål 16'!$I$24)","v":0},{"$f":"IF('Mål 16'!$J$24=\"\",0,'Mål 16'!$J$24)","v":0},{"$f":"IF('Mål 16'!$K$24=\"\",0,'Mål 16'!$K$24)","v":"00:00:00"}]
[null,null,"Mål 16",{"$f":"IF('Mål 16'!$C$25=\"\",0,'Mål 16'!$C$25)","v":0},{"$f":"IF('Mål 16'!$I$25=\"\",0,'Mål 16'!$I$25)","v":0},{"$f":"IF('Mål 16'!$J$25=\"\",0,'Mål 16'!$J$25)","v":0},{"$f":"IF('Mål 16'!$K$25=\"\",0,'Mål 16'!$K$25)","v":"00:00:00"}]
[null,null,"Mål 16",{"$f":"IF('Mål 16'!$C$26=\"\",0,'Mål 16'!$C$26)","v":0},{"$f":"IF('Mål 16'!$I$26=\"\",0,'Mål 16'!$I$26)","v":0},{"$f":"IF('Mål 16'!$J$26=\"\",0,'Mål 16'!$J$26)","v":0},{"$f":"IF('Mål 16'!$K$26=\"\",0,'Mål 16'!$K$26)","v":"00:00:00"}]
[null,null,"Mål 16",{"$f":"IF('Mål 16'!$C$27=\"\",0,'Mål 16'!$C$27)","v":0},{"$f":"IF('Mål 16'!$I$27=\"\",0,'Mål 16'!$I$27)","v":0},{"$f":"IF('Mål 16'!$J$27=\"\",0,'Mål 16'!$J$27)","v":0},{"$f":"IF('Mål 16'!$K$27=\"\",0,'Mål 16'!$K$27)","v":"00:00:00"}]
[null,null,"Mål 17",{"$f":"IF('Mål 17'!$C$8=\"\",0,'Mål 17'!$C$8)","v":0},{"$f":"IF('Mål 17'!$I$8=\"\",0,'Mål 17'!$I$8)","v":0},{"$f":"IF('Mål 17'!$J$8=\"\",0,'Mål 17'!$J$8)","v":0},{"$f":"IF('Mål 17'!$K$8=\"\",0,'Mål 17'!$K$8)","v":"00:00:00"}]
[null,null,"Mål 17",{"$f":"IF('Mål 17'!$C$9=\"\",0,'Mål 17'!$C$9)","v":0},{"$f":"IF('Mål 17'!$I$9=\"\",0,'Mål 17'!$I$9)","v":0},{"$f":"IF('Mål 17'!$J$9=\"\",0,'Mål 17'!$J$9)","v":0},{"$f":"IF('Mål 17'!$K$9=\"\",0,'Mål 17'!$K$9)","v":"00:00:00"}]
[null,null,"Mål 17",{"$f":"IF('Mål 17'!$C$10=\"\",0,'Mål 17'!$C$10)","v":0},{"$f":"IF('Mål 17'!$I$10=\"\",0,'Mål 17'!$I$10)","v":0},{"$f":"IF('Mål 17'!$J$10=\"\",0,'Mål 17'!$J$10)","v":0},{"$f":"IF('Mål 17'!$K$10=\"\",0,'Mål 17'!$K$10)","v":"00:00:00"}]
[null,null,"Mål 17",{"$f":"IF('Mål 17'!$C$11=\"\",0,'Mål 17'!$C331)","v":0},{"$f":"IF('Mål 17'!$I$11=\"\",0,'Mål 17'!$I331)","v":0},{"$f":"IF('Mål 17'!$J$11=\"\",0,'Mål 17'!$J331)","v":0},{"$f":"IF('Mål 17'!$K$11=\"\",0,'Mål 17'!$K331)","v":"00:00:00"}]
[null,null,"Mål 17",{"$f":"IF('Mål 17'!$C$12=\"\",0,'Mål 17'!$C$12)","v":0},{"$f":"IF('Mål 17'!$I$12=\"\",0,'Mål 17'!$I$12)","v":0},{"$f":"IF('Mål 17'!$J$12=\"\",0,'Mål 17'!$J$12)","v":0},{"$f":"IF('Mål 17'!$K$12=\"\",0,'Mål 17'!$K$12)","v":"00:00:00"}]
[null,null,"Mål 17",{"$f":"IF('Mål 17'!$C$13=\"\",0,'Mål 17'!$C$13)","v":0},{"$f":"IF('Mål 17'!$I$13=\"\",0,'Mål 17'!$I$13)","v":0},{"$f":"IF('Mål 17'!$J$13=\"\",0,'Mål 17'!$J$13)","v":0},{"$f":"IF('Mål 17'!$K$13=\"\",0,'Mål 17'!$K$13)","v":"00:00:00"}]
[null,null,"Mål 17",{"$f":"IF('Mål 17'!$C$14=\"\",0,'Mål 17'!$C$14)","v":0},{"$f":"IF('Mål 17'!$I$14=\"\",0,'Mål 17'!$I$14)","v":0},{"$f":"IF('Mål 17'!$J$14=\"\",0,'Mål 17'!$J$14)","v":0},{"$f":"IF('Mål 17'!$K$14=\"\",0,'Mål 17'!$K$14)","v":"00:00:00"}]
[null,null,"Mål 17",{"$f":"IF('Mål 17'!$C$15=\"\",0,'Mål 17'!$C$15)","v":0},{"$f":"IF('Mål 17'!$I$15=\"\",0,'Mål 17'!$I$15)","v":0},{"$f":"IF('Mål 17'!$J$15=\"\",0,'Mål 17'!$J$15)","v":0},{"$f":"IF('Mål 17'!$K$15=\"\",0,'Mål 17'!$K$15)","v":"00:00:00"}]
[null,null,"Mål 17",{"$f":"IF('Mål 17'!$C$16=\"\",0,'Mål 17'!$C$16)","v":0},{"$f":"IF('Mål 17'!$I$16=\"\",0,'Mål 17'!$I$16)","v":0},{"$f":"IF('Mål 17'!$J$16=\"\",0,'Mål 17'!$J$16)","v":0},{"$f":"IF('Mål 17'!$K$16=\"\",0,'Mål 17'!$K$16)","v":"00:00:00"}]
[null,null,"Mål 17",{"$f":"IF('Mål 17'!$C$17=\"\",0,'Mål 17'!$C$17)","v":0},{"$f":"IF('Mål 17'!$I$17=\"\",0,'Mål 17'!$I$17)","v":0},{"$f":"IF('Mål 17'!$J$17=\"\",0,'Mål 17'!$J$17)","v":0},{"$f":"IF('Mål 17'!$K$17=\"\",0,'Mål 17'!$K$17)","v":"00:00:00"}]
[null,null,"Mål 17",{"$f":"IF('Mål 17'!$C$18=\"\",0,'Mål 17'!$C$18)","v":0},{"$f":"IF('Mål 17'!$I$18=\"\",0,'Mål 17'!$I$18)","v":0},{"$f":"IF('Mål 17'!$J$18=\"\",0,'Mål 17'!$J$18)","v":0},{"$f":"IF('Mål 17'!$K$18=\"\",0,'Mål 17'!$K$18)","v":"00:00:00"}]
[null,null,"Mål 17",{"$f":"IF('Mål 17'!$C$19=\"\",0,'Mål 17'!$C$19)","v":0},{"$f":"IF('Mål 17'!$I$19=\"\",0,'Mål 17'!$I$19)","v":0},{"$f":"IF('Mål 17'!$J$19=\"\",0,'Mål 17'!$J$19)","v":0},{"$f":"IF('Mål 17'!$K$19=\"\",0,'Mål 17'!$K$19)","v":"00:00:00"}]
[null,null,"Mål 17",{"$f":"IF('Mål 17'!$C$20=\"\",0,'Mål 17'!$C$20)","v":0},{"$f":"IF('Mål 17'!$I$20=\"\",0,'Mål 17'!$I$20)","v":0},{"$f":"IF('Mål 17'!$J$20=\"\",0,'Mål 17'!$J$20)","v":0},{"$f":"IF('Mål 17'!$K$20=\"\",0,'Mål 17'!$K$20)","v":"00:00:00"}]
[null,null,"Mål 17",{"$f":"IF('Mål 17'!$C$21=\"\",0,'Mål 17'!$C$21)","v":0},{"$f":"IF('Mål 17'!$I$21=\"\",0,'Mål 17'!$I$21)","v":0},{"$f":"IF('Mål 17'!$J$21=\"\",0,'Mål 17'!$J$21)","v":0},{"$f":"IF('Mål 17'!$K$21=\"\",0,'Mål 17'!$K$21)","v":"00:00:00"}]
[null,null,"Mål 17",{"$f":"IF('Mål 17'!$C$22=\"\",0,'Mål 17'!$C$22)","v":0},{"$f":"IF('Mål 17'!$I$22=\"\",0,'Mål 17'!$I$22)","v":0},{"$f":"IF('Mål 17'!$J$22=\"\",0,'Mål 17'!$J$22)","v":0},{"$f":"IF('Mål 17'!$K$22=\"\",0,'Mål 17'!$K$22)","v":"00:00:00"}]
[null,null,"Mål 17",{"$f":"IF('Mål 17'!$C$23=\"\",0,'Mål 17'!$C$23)","v":0},{"$f":"IF('Mål 17'!$I$23=\"\",0,'Mål 17'!$I$23)","v":0},{"$f":"IF('Mål 17'!$J$23=\"\",0,'Mål 17'!$J$23)","v":0},{"$f":"IF('Mål 17'!$K$23=\"\",0,'Mål 17'!$K$23)","v":"00:00:00"}]
[null,null,"Mål 17",{"$f":"IF('Mål 17'!$C$24=\"\",0,'Mål 17'!$C$24)","v":0},{"$f":"IF('Mål 17'!$I$24=\"\",0,'Mål 17'!$I$24)","v":0},{"$f":"IF('Mål 17'!$J$24=\"\",0,'Mål 17'!$J$24)","v":0},{"$f":"IF('Mål 17'!$K$24=\"\",0,'Mål 17'!$K$24)","v":"00:00:00"}]
[null,null,"Mål 17",{"$f":"IF('Mål 17'!$C$25=\"\",0,'Mål 17'!$C$25)","v":0},{"$f":"IF('Mål 17'!$I$25=\"\",0,'Mål 17'!$I$25)","v":0},{"$f":"IF('Mål 17'!$J$25=\"\",0,'Mål 17'!$J$25)","v":0},{"$f":"IF('Mål 17'!$K$25=\"\",0,'Mål 17'!$K$25)","v":"00:00:00"}]
[null,null,"Mål 17",{"$f":"IF('Mål 17'!$C$26=\"\",0,'Mål 17'!$C$26)","v":0},{"$f":"IF('Mål 17'!$I$26=\"\",0,'Mål 17'!$I$26)","v":0},{"$f":"IF('Mål 17'!$J$26=\"\",0,'Mål 17'!$J$26)","v":0},{"$f":"IF('Mål 17'!$K$26=\"\",0,'Mål 17'!$K$26)","v":"00:00:00"}]
[null,null,"Mål 17",{"$f":"IF('Mål 17'!$C$27=\"\",0,'Mål 17'!$C$27)","v":0},{"$f":"IF('Mål 17'!$I$27=\"\",0,'Mål 17'!$I$27)","v":0},{"$f":"IF('Mål 17'!$J$27=\"\",0,'Mål 17'!$J$27)","v":0},{"$f":"IF('Mål 17'!$K$27=\"\",0,'Mål 17'!$K$27)","v":"00:00:00"}]
[null,null,"Mål 18",{"$f":"IF('Mål 18'!$C$8=\"\",0,'Mål 18'!$C$8)","v":0},{"$f":"IF('Mål 18'!$I$8=\"\",0,'Mål 18'!$I$8)","v":0},{"$f":"IF('Mål 18'!$J$8=\"\",0,'Mål 18'!$J$8)","v":0},{"$f":"IF('Mål 18'!$K$8=\"\",0,'Mål 18'!$K$8)","v":"00:00:00"}]
[null,null,"Mål 18",{"$f":"IF('Mål 18'!$C$9=\"\",0,'Mål 18'!$C$9)","v":0},{"$f":"IF('Mål 18'!$I$9=\"\",0,'Mål 18'!$I$9)","v":0},{"$f":"IF('Mål 18'!$J$9=\"\",0,'Mål 18'!$J$9)","v":0},{"$f":"IF('Mål 18'!$K$9=\"\",0,'Mål 18'!$K$9)","v":"00:00:00"}]
[null,null,"Mål 18",{"$f":"IF('Mål 18'!$C$10=\"\",0,'Mål 18'!$C$10)","v":0},{"$f":"IF('Mål 18'!$I$10=\"\",0,'Mål 18'!$I$10)","v":0},{"$f":"IF('Mål 18'!$J$10=\"\",0,'Mål 18'!$J$10)","v":0},{"$f":"IF('Mål 18'!$K$10=\"\",0,'Mål 18'!$K$10)","v":"00:00:00"}]
[null,null,"Mål 18",{"$f":"IF('Mål 18'!$C$11=\"\",0,'Mål 18'!$C351)","v":0},{"$f":"IF('Mål 18'!$I$11=\"\",0,'Mål 18'!$I351)","v":0},{"$f":"IF('Mål 18'!$J$11=\"\",0,'Mål 18'!$J351)","v":0},{"$f":"IF('Mål 18'!$K$11=\"\",0,'Mål 18'!$K351)","v":"00:00:00"}]
[null,null,"Mål 18",{"$f":"IF('Mål 18'!$C$12=\"\",0,'Mål 18'!$C$12)","v":0},{"$f":"IF('Mål 18'!$I$12=\"\",0,'Mål 18'!$I$12)","v":0},{"$f":"IF('Mål 18'!$J$12=\"\",0,'Mål 18'!$J$12)","v":0},{"$f":"IF('Mål 18'!$K$12=\"\",0,'Mål 18'!$K$12)","v":"00:00:00"}]
[null,null,"Mål 18",{"$f":"IF('Mål 18'!$C$13=\"\",0,'Mål 18'!$C$13)","v":0},{"$f":"IF('Mål 18'!$I$13=\"\",0,'Mål 18'!$I$13)","v":0},{"$f":"IF('Mål 18'!$J$13=\"\",0,'Mål 18'!$J$13)","v":0},{"$f":"IF('Mål 18'!$K$13=\"\",0,'Mål 18'!$K$13)","v":"00:00:00"}]
[null,null,"Mål 18",{"$f":"IF('Mål 18'!$C$14=\"\",0,'Mål 18'!$C$14)","v":0},{"$f":"IF('Mål 18'!$I$14=\"\",0,'Mål 18'!$I$14)","v":0},{"$f":"IF('Mål 18'!$J$14=\"\",0,'Mål 18'!$J$14)","v":0},{"$f":"IF('Mål 18'!$K$14=\"\",0,'Mål 18'!$K$14)","v":"00:00:00"}]
[null,null,"Mål 18",{"$f":"IF('Mål 18'!$C$15=\"\",0,'Mål 18'!$C$15)","v":0},{"$f":"IF('Mål 18'!$I$15=\"\",0,'Mål 18'!$I$15)","v":0},{"$f":"IF('Mål 18'!$J$15=\"\",0,'Mål 18'!$J$15)","v":0},{"$f":"IF('Mål 18'!$K$15=\"\",0,'Mål 18'!$K$15)","v":"00:00:00"}]
[null,null,"Mål 18",{"$f":"IF('Mål 18'!$C$16=\"\",0,'Mål 18'!$C$16)","v":0},{"$f":"IF('Mål 18'!$I$16=\"\",0,'Mål 18'!$I$16)","v":0},{"$f":"IF('Mål 18'!$J$16=\"\",0,'Mål 18'!$J$16)","v":0},{"$f":"IF('Mål 18'!$K$16=\"\",0,'Mål 18'!$K$16)","v":"00:00:00"}]
[null,null,"Mål 18",{"$f":"IF('Mål 18'!$C$17=\"\",0,'Mål 18'!$C$17)","v":0},{"$f":"IF('Mål 18'!$I$17=\"\",0,'Mål 18'!$I$17)","v":0},{"$f":"IF('Mål 18'!$J$17=\"\",0,'Mål 18'!$J$17)","v":0},{"$f":"IF('Mål 18'!$K$17=\"\",0,'Mål 18'!$K$17)","v":"00:00:00"}]
[null,null,"Mål 18",{"$f":"IF('Mål 18'!$C$18=\"\",0,'Mål 18'!$C$18)","v":0},{"$f":"IF('Mål 18'!$I$18=\"\",0,'Mål 18'!$I$18)","v":0},{"$f":"IF('Mål 18'!$J$18=\"\",0,'Mål 18'!$J$18)","v":0},{"$f":"IF('Mål 18'!$K$18=\"\",0,'Mål 18'!$K$18)","v":"00:00:00"}]
[null,null,"Mål 18",{"$f":"IF('Mål 18'!$C$19=\"\",0,'Mål 18'!$C$19)","v":0},{"$f":"IF('Mål 18'!$I$19=\"\",0,'Mål 18'!$I$19)","v":0},{"$f":"IF('Mål 18'!$J$19=\"\",0,'Mål 18'!$J$19)","v":0},{"$f":"IF('Mål 18'!$K$19=\"\",0,'Mål 18'!$K$19)","v":"00:00:00"}]
[null,null,"Mål 18",{"$f":"IF('Mål 18'!$C$20=\"\",0,'Mål 18'!$C$20)","v":0},{"$f":"IF('Mål 18'!$I$20=\"\",0,'Mål 18'!$I$20)","v":0},{"$f":"IF('Mål 18'!$J$20=\"\",0,'Mål 18'!$J$20)","v":0},{"$f":"IF('Mål 18'!$K$20=\"\",0,'Mål 18'!$K$20)","v":"00:00:00"}]
[null,null,"Mål 18",{"$f":"IF('Mål 18'!$C$21=\"\",0,'Mål 18'!$C$21)","v":0},{"$f":"IF('Mål 18'!$I$21=\"\",0,'Mål 18'!$I$21)","v":0},{"$f":"IF('Mål 18'!$J$21=\"\",0,'Mål 18'!$J$21)","v":0},{"$f":"IF('Mål 18'!$K$21=\"\",0,'Mål 18'!$K$21)","v":"00:00:00"}]
[null,null,"Mål 18",{"$f":"IF('Mål 18'!$C$22=\"\",0,'Mål 18'!$C$22)","v":0},{"$f":"IF('Mål 18'!$I$22=\"\",0,'Mål 18'!$I$22)","v":0},{"$f":"IF('Mål 18'!$J$22=\"\",0,'Mål 18'!$J$22)","v":0},{"$f":"IF('Mål 18'!$K$22=\"\",0,'Mål 18'!$K$22)","v":"00:00:00"}]
[null,null,"Mål 18",{"$f":"IF('Mål 18'!$C$23=\"\",0,'Mål 18'!$C$23)","v":0},{"$f":"IF('Mål 18'!$I$23=\"\",0,'Mål 18'!$I$23)","v":0},{"$f":"IF('Mål 18'!$J$23=\"\",0,'Mål 18'!$J$23)","v":0},{"$f":"IF('Mål 18'!$K$23=\"\",0,'Mål 18'!$K$23)","v":"00:00:00"}]
[null,null,"Mål 18",{"$f":"IF('Mål 18'!$C$24=\"\",0,'Mål 18'!$C$24)","v":0},{"$f":"IF('Mål 18'!$I$24=\"\",0,'Mål 18'!$I$24)","v":0},{"$f":"IF('Mål 18'!$J$24=\"\",0,'Mål 18'!$J$24)","v":0},{"$f":"IF('Mål 18'!$K$24=\"\",0,'Mål 18'!$K$24)","v":"00:00:00"}]
[null,null,"Mål 18",{"$f":"IF('Mål 18'!$C$25=\"\",0,'Mål 18'!$C$25)","v":0},{"$f":"IF('Mål 18'!$I$25=\"\",0,'Mål 18'!$I$25)","v":0},{"$f":"IF('Mål 18'!$J$25=\"\",0,'Mål 18'!$J$25)","v":0},{"$f":"IF('Mål 18'!$K$25=\"\",0,'Mål 18'!$K$25)","v":"00:00:00"}]
[null,null,"Mål 18",{"$f":"IF('Mål 18'!$C$26=\"\",0,'Mål 18'!$C$26)","v":0},{"$f":"IF('Mål 18'!$I$26=\"\",0,'Mål 18'!$I$26)","v":0},{"$f":"IF('Mål 18'!$J$26=\"\",0,'Mål 18'!$J$26)","v":0},{"$f":"IF('Mål 18'!$K$26=\"\",0,'Mål 18'!$K$26)","v":"00:00:00"}]
[null,null,"Mål 18",{"$f":"IF('Mål 18'!$C$27=\"\",0,'Mål 18'!$C$27)","v":0},{"$f":"IF('Mål 18'!$I$27=\"\",0,'Mål 18'!$I$27)","v":0},{"$f":"IF('Mål 18'!$J$27=\"\",0,'Mål 18'!$J$27)","v":0},{"$f":"IF('Mål 18'!$K$27=\"\",0,'Mål 18'!$K$27)","v":"00:00:00"}]
[null,null,"Mål 19",{"$f":"IF('Mål 19'!$C$8=\"\",0,'Mål 19'!$C$8)","v":0},{"$f":"IF('Mål 19'!$I$8=\"\",0,'Mål 19'!$I$8)","v":0},{"$f":"IF('Mål 19'!$J$8=\"\",0,'Mål 19'!$J$8)","v":0},{"$f":"IF('Mål 19'!$K$8=\"\",0,'Mål 19'!$K$8)","v":"00:00:00"}]
[null,null,"Mål 19",{"$f":"IF('Mål 19'!$C$9=\"\",0,'Mål 19'!$C$9)","v":0},{"$f":"IF('Mål 19'!$I$9=\"\",0,'Mål 19'!$I$9)","v":0},{"$f":"IF('Mål 19'!$J$9=\"\",0,'Mål 19'!$J$9)","v":0},{"$f":"IF('Mål 19'!$K$9=\"\",0,'Mål 19'!$K$9)","v":"00:00:00"}]
[null,null,"Mål 19",{"$f":"IF('Mål 19'!$C$10=\"\",0,'Mål 19'!$C$10)","v":0},{"$f":"IF('Mål 19'!$I$10=\"\",0,'Mål 19'!$I$10)","v":0},{"$f":"IF('Mål 19'!$J$10=\"\",0,'Mål 19'!$J$10)","v":0},{"$f":"IF('Mål 19'!$K$10=\"\",0,'Mål 19'!$K$10)","v":"00:00:00"}]
[null,null,"Mål 19",{"$f":"IF('Mål 19'!$C$11=\"\",0,'Mål 19'!$C371)","v":0},{"$f":"IF('Mål 19'!$I$11=\"\",0,'Mål 19'!$I371)","v":0},{"$f":"IF('Mål 19'!$J$11=\"\",0,'Mål 19'!$J371)","v":0},{"$f":"IF('Mål 19'!$K$11=\"\",0,'Mål 19'!$K371)","v":"00:00:00"}]
[null,null,"Mål 19",{"$f":"IF('Mål 19'!$C$12=\"\",0,'Mål 19'!$C$12)","v":0},{"$f":"IF('Mål 19'!$I$12=\"\",0,'Mål 19'!$I$12)","v":0},{"$f":"IF('Mål 19'!$J$12=\"\",0,'Mål 19'!$J$12)","v":0},{"$f":"IF('Mål 19'!$K$12=\"\",0,'Mål 19'!$K$12)","v":"00:00:00"}]
[null,null,"Mål 19",{"$f":"IF('Mål 19'!$C$13=\"\",0,'Mål 19'!$C$13)","v":0},{"$f":"IF('Mål 19'!$I$13=\"\",0,'Mål 19'!$I$13)","v":0},{"$f":"IF('Mål 19'!$J$13=\"\",0,'Mål 19'!$J$13)","v":0},{"$f":"IF('Mål 19'!$K$13=\"\",0,'Mål 19'!$K$13)","v":"00:00:00"}]
[null,null,"Mål 19",{"$f":"IF('Mål 19'!$C$14=\"\",0,'Mål 19'!$C$14)","v":0},{"$f":"IF('Mål 19'!$I$14=\"\",0,'Mål 19'!$I$14)","v":0},{"$f":"IF('Mål 19'!$J$14=\"\",0,'Mål 19'!$J$14)","v":0},{"$f":"IF('Mål 19'!$K$14=\"\",0,'Mål 19'!$K$14)","v":"00:00:00"}]
[null,null,"Mål 19",{"$f":"IF('Mål 19'!$C$15=\"\",0,'Mål 19'!$C$15)","v":0},{"$f":"IF('Mål 19'!$I$15=\"\",0,'Mål 19'!$I$15)","v":0},{"$f":"IF('Mål 19'!$J$15=\"\",0,'Mål 19'!$J$15)","v":0},{"$f":"IF('Mål 19'!$K$15=\"\",0,'Mål 19'!$K$15)","v":"00:00:00"}]
[null,null,"Mål 19",{"$f":"IF('Mål 19'!$C$16=\"\",0,'Mål 19'!$C$16)","v":0},{"$f":"IF('Mål 19'!$I$16=\"\",0,'Mål 19'!$I$16)","v":0},{"$f":"IF('Mål 19'!$J$16=\"\",0,'Mål 19'!$J$16)","v":0},{"$f":"IF('Mål 19'!$K$16=\"\",0,'Mål 19'!$K$16)","v":"00:00:00"}]
[null,null,"Mål 19",{"$f":"IF('Mål 19'!$C$17=\"\",0,'Mål 19'!$C$17)","v":0},{"$f":"IF('Mål 19'!$I$17=\"\",0,'Mål 19'!$I$17)","v":0},{"$f":"IF('Mål 19'!$J$17=\"\",0,'Mål 19'!$J$17)","v":0},{"$f":"IF('Mål 19'!$K$17=\"\",0,'Mål 19'!$K$17)","v":"00:00:00"}]
[null,null,"Mål 19",{"$f":"IF('Mål 19'!$C$18=\"\",0,'Mål 19'!$C$18)","v":0},{"$f":"IF('Mål 19'!$I$18=\"\",0,'Mål 19'!$I$18)","v":0},{"$f":"IF('Mål 19'!$J$18=\"\",0,'Mål 19'!$J$18)","v":0},{"$f":"IF('Mål 19'!$K$18=\"\",0,'Mål 19'!$K$18)","v":"00:00:00"}]
[null,null,"Mål 19",{"$f":"IF('Mål 19'!$C$19=\"\",0,'Mål 19'!$C$19)","v":0},{"$f":"IF('Mål 19'!$I$19=\"\",0,'Mål 19'!$I$19)","v":0},{"$f":"IF('Mål 19'!$J$19=\"\",0,'Mål 19'!$J$19)","v":0},{"$f":"IF('Mål 19'!$K$19=\"\",0,'Mål 19'!$K$19)","v":"00:00:00"}]
[null,null,"Mål 19",{"$f":"IF('Mål 19'!$C$20=\"\",0,'Mål 19'!$C$20)","v":0},{"$f":"IF('Mål 19'!$I$20=\"\",0,'Mål 19'!$I$20)","v":0},{"$f":"IF('Mål 19'!$J$20=\"\",0,'Mål 19'!$J$20)","v":0},{"$f":"IF('Mål 19'!$K$20=\"\",0,'Mål 19'!$K$20)","v":"00:00:00"}]
[null,null,"Mål 19",{"$f":"IF('Mål 19'!$C$21=\"\",0,'Mål 19'!$C$21)","v":0},{"$f":"IF('Mål 19'!$I$21=\"\",0,'Mål 19'!$I$21)","v":0},{"$f":"IF('Mål 19'!$J$21=\"\",0,'Mål 19'!$J$21)","v":0},{"$f":"IF('Mål 19'!$K$21=\"\",0,'Mål 19'!$K$21)","v":"00:00:00"}]
[null,null,"Mål 19",{"$f":"IF('Mål 19'!$C$22=\"\",0,'Mål 19'!$C$22)","v":0},{"$f":"IF('Mål 19'!$I$22=\"\",0,'Mål 19'!$I$22)","v":0},{"$f":"IF('Mål 19'!$J$22=\"\",0,'Mål 19'!$J$22)","v":0},{"$f":"IF('Mål 19'!$K$22=\"\",0,'Mål 19'!$K$22)","v":"00:00:00"}]
[null,null,"Mål 19",{"$f":"IF('Mål 19'!$C$23=\"\",0,'Mål 19'!$C$23)","v":0},{"$f":"IF('Mål 19'!$I$23=\"\",0,'Mål 19'!$I$23)","v":0},{"$f":"IF('Mål 19'!$J$23=\"\",0,'Mål 19'!$J$23)","v":0},{"$f":"IF('Mål 19'!$K$23=\"\",0,'Mål 19'!$K$23)","v":"00:00:00"}]
[null,null,"Mål 19",{"$f":"IF('Mål 19'!$C$24=\"\",0,'Mål 19'!$C$24)","v":0},{"$f":"IF('Mål 19'!$I$24=\"\",0,'Mål 19'!$I$24)","v":0},{"$f":"IF('Mål 19'!$J$24=\"\",0,'Mål 19'!$J$24)","v":0},{"$f":"IF('Mål 19'!$K$24=\"\",0,'Mål 19'!$K$24)","v":"00:00:00"}]
[null,null,"Mål 19",{"$f":"IF('Mål 19'!$C$25=\"\",0,'Mål 19'!$C$25)","v":0},{"$f":"IF('Mål 19'!$I$25=\"\",0,'Mål 19'!$I$25)","v":0},{"$f":"IF('Mål 19'!$J$25=\"\",0,'Mål 19'!$J$25)","v":0},{"$f":"IF('Mål 19'!$K$25=\"\",0,'Mål 19'!$K$25)","v":"00:00:00"}]
[null,null,"Mål 19",{"$f":"IF('Mål 19'!$C$26=\"\",0,'Mål 19'!$C$26)","v":0},{"$f":"IF('Mål 19'!$I$26=\"\",0,'Mål 19'!$I$26)","v":0},{"$f":"IF('Mål 19'!$J$26=\"\",0,'Mål 19'!$J$26)","v":0},{"$f":"IF('Mål 19'!$K$26=\"\",0,'Mål 19'!$K$26)","v":"00:00:00"}]
[null,null,"Mål 19",{"$f":"IF('Mål 19'!$C$27=\"\",0,'Mål 19'!$C$27)","v":0},{"$f":"IF('Mål 19'!$I$27=\"\",0,'Mål 19'!$I$27)","v":0},{"$f":"IF('Mål 19'!$J$27=\"\",0,'Mål 19'!$J$27)","v":0},{"$f":"IF('Mål 19'!$K$27=\"\",0,'Mål 19'!$K$27)","v":"00:00:00"}]
[null,null,"Mål 20",{"$f":"IF('Mål 20'!$C$8=\"\",0,'Mål 20'!$C$8)","v":0},{"$f":"IF('Mål 20'!$I$8=\"\",0,'Mål 20'!$I$8)","v":0},{"$f":"IF('Mål 20'!$J$8=\"\",0,'Mål 20'!$J$8)","v":0},{"$f":"IF('Mål 20'!$K$8=\"\",0,'Mål 20'!$K$8)","v":"00:00:00"}]
[null,null,"Mål 20",{"$f":"IF('Mål 20'!$C$9=\"\",0,'Mål 20'!$C$9)","v":0},{"$f":"IF('Mål 20'!$I$9=\"\",0,'Mål 20'!$I$9)","v":0},{"$f":"IF('Mål 20'!$J$9=\"\",0,'Mål 20'!$J$9)","v":0},{"$f":"IF('Mål 20'!$K$9=\"\",0,'Mål 20'!$K$9)","v":"00:00:00"}]
[null,null,"Mål 20",{"$f":"IF('Mål 20'!$C$10=\"\",0,'Mål 20'!$C$10)","v":0},{"$f":"IF('Mål 20'!$I$10=\"\",0,'Mål 20'!$I$10)","v":0},{"$f":"IF('Mål 20'!$J$10=\"\",0,'Mål 20'!$J$10)","v":0},{"$f":"IF('Mål 20'!$K$10=\"\",0,'Mål 20'!$K$10)","v":"00:00:00"}]
[null,null,"Mål 20",{"$f":"IF('Mål 20'!$C$11=\"\",0,'Mål 20'!$C391)","v":0},{"$f":"IF('Mål 20'!$I$11=\"\",0,'Mål 20'!$I391)","v":0},{"$f":"IF('Mål 20'!$J$11=\"\",0,'Mål 20'!$J391)","v":0},{"$f":"IF('Mål 20'!$K$11=\"\",0,'Mål 20'!$K391)","v":"00:00:00"}]
[null,null,"Mål 20",{"$f":"IF('Mål 20'!$C$12=\"\",0,'Mål 20'!$C$12)","v":0},{"$f":"IF('Mål 20'!$I$12=\"\",0,'Mål 20'!$I$12)","v":0},{"$f":"IF('Mål 20'!$J$12=\"\",0,'Mål 20'!$J$12)","v":0},{"$f":"IF('Mål 20'!$K$12=\"\",0,'Mål 20'!$K$12)","v":"00:00:00"}]
[null,null,"Mål 20",{"$f":"IF('Mål 20'!$C$13=\"\",0,'Mål 20'!$C$13)","v":0},{"$f":"IF('Mål 20'!$I$13=\"\",0,'Mål 20'!$I$13)","v":0},{"$f":"IF('Mål 20'!$J$13=\"\",0,'Mål 20'!$J$13)","v":0},{"$f":"IF('Mål 20'!$K$13=\"\",0,'Mål 20'!$K$13)","v":"00:00:00"}]
[null,null,"Mål 20",{"$f":"IF('Mål 20'!$C$14=\"\",0,'Mål 20'!$C$14)","v":0},{"$f":"IF('Mål 20'!$I$14=\"\",0,'Mål 20'!$I$14)","v":0},{"$f":"IF('Mål 20'!$J$14=\"\",0,'Mål 20'!$J$14)","v":0},{"$f":"IF('Mål 20'!$K$14=\"\",0,'Mål 20'!$K$14)","v":"00:00:00"}]
[null,null,"Mål 20",{"$f":"IF('Mål 20'!$C$15=\"\",0,'Mål 20'!$C$15)","v":0},{"$f":"IF('Mål 20'!$I$15=\"\",0,'Mål 20'!$I$15)","v":0},{"$f":"IF('Mål 20'!$J$15=\"\",0,'Mål 20'!$J$15)","v":0},{"$f":"IF('Mål 20'!$K$15=\"\",0,'Mål 20'!$K$15)","v":"00:00:00"}]
[null,null,"Mål 20",{"$f":"IF('Mål 20'!$C$16=\"\",0,'Mål 20'!$C$16)","v":0},{"$f":"IF('Mål 20'!$I$16=\"\",0,'Mål 20'!$I$16)","v":0},{"$f":"IF('Mål 20'!$J$16=\"\",0,'Mål 20'!$J$16)","v":0},{"$f":"IF('Mål 20'!$K$16=\"\",0,'Mål 20'!$K$16)","v":"00:00:00"}]
[null,null,"Mål 20",{"$f":"IF('Mål 20'!$C$17=\"\",0,'Mål 20'!$C$17)","v":0},{"$f":"IF('Mål 20'!$I$17=\"\",0,'Mål 20'!$I$17)","v":0},{"$f":"IF('Mål 20'!$J$17=\"\",0,'Mål 20'!$J$17)","v":0},{"$f":"IF('Mål 20'!$K$17=\"\",0,'Mål 20'!$K$17)","v":"00:00:00"}]
[null,null,"Mål 20",{"$f":"IF('Mål 20'!$C$18=\"\",0,'Mål 20'!$C$18)","v":0},{"$f":"IF('Mål 20'!$I$18=\"\",0,'Mål 20'!$I$18)","v":0},{"$f":"IF('Mål 20'!$J$18=\"\",0,'Mål 20'!$J$18)","v":0},{"$f":"IF('Mål 20'!$K$18=\"\",0,'Mål 20'!$K$18)","v":"00:00:00"}]
[null,null,"Mål 20",{"$f":"IF('Mål 20'!$C$19=\"\",0,'Mål 20'!$C$19)","v":0},{"$f":"IF('Mål 20'!$I$19=\"\",0,'Mål 20'!$I$19)","v":0},{"$f":"IF('Mål 20'!$J$19=\"\",0,'Mål 20'!$J$19)","v":0},{"$f":"IF('Mål 20'!$K$19=\"\",0,'Mål 20'!$K$19)","v":"00:00:00"}]
[null,null,"Mål 20",{"$f":"IF('Mål 20'!$C$20=\"\",0,'Mål 20'!$C$20)","v":0},{"$f":"IF('Mål 20'!$I$20=\"\",0,'Mål 20'!$I$20)","v":0},{"$f":"IF('Mål 20'!$J$20=\"\",0,'Mål 20'!$J$20)","v":0},{"$f":"IF('Mål 20'!$K$20=\"\",0,'Mål 20'!$K$20)","v":"00:00:00"}]
[null,null,"Mål 20",{"$f":"IF('Mål 20'!$C$21=\"\",0,'Mål 20'!$C$21)","v":0},{"$f":"IF('Mål 20'!$I$21=\"\",0,'Mål 20'!$I$21)","v":0},{"$f":"IF('Mål 20'!$J$21=\"\",0,'Mål 20'!$J$21)","v":0},{"$f":"IF('Mål 20'!$K$21=\"\",0,'Mål 20'!$K$21)","v":"00:00:00"}]
[null,null,"Mål 20",{"$f":"IF('Mål 20'!$C$22=\"\",0,'Mål 20'!$C$22)","v":0},{"$f":"IF('Mål 20'!$I$22=\"\",0,'Mål 20'!$I$22)","v":0},{"$f":"IF('Mål 20'!$J$22=\"\",0,'Mål 20'!$J$22)","v":0},{"$f":"IF('Mål 20'!$K$22=\"\",0,'Mål 20'!$K$22)","v":"00:00:00"}]
[null,null,"Mål 20",{"$f":"IF('Mål 20'!$C$23=\"\",0,'Mål 20'!$C$23)","v":0},{"$f":"IF('Mål 20'!$I$23=\"\",0,'Mål 20'!$I$23)","v":0},{"$f":"IF('Mål 20'!$J$23=\"\",0,'Mål 20'!$J$23)","v":0},{"$f":"IF('Mål 20'!$K$23=\"\",0,'Mål 20'!$K$23)","v":"00:00:00"}]
[null,null,"Mål 20",{"$f":"IF('Mål 20'!$C$24=\"\",0,'Mål 20'!$C$24)","v":0},{"$f":"IF('Mål 20'!$I$24=\"\",0,'Mål 20'!$I$24)","v":0},{"$f":"IF('Mål 20'!$J$24=\"\",0,'Mål 20'!$J$24)","v":0},{"$f":"IF('Mål 20'!$K$24=\"\",0,'Mål 20'!$K$24)","v":"00:00:00"}]
[null,null,"Mål 20",{"$f":"IF('Mål 20'!$C$25=\"\",0,'Mål 20'!$C$25)","v":0},{"$f":"IF('Mål 20'!$I$25=\"\",0,'Mål 20'!$I$25)","v":0},{"$f":"IF('Mål 20'!$J$25=\"\",0,'Mål 20'!$J$25)","v":0},{"$f":"IF('Mål 20'!$K$25=\"\",0,'Mål 20'!$K$25)","v":"00:00:00"}]
[null,null,"Mål 20",{"$f":"IF('Mål 20'!$C$26=\"\",0,'Mål 20'!$C$26)","v":0},{"$f":"IF('Mål 20'!$I$26=\"\",0,'Mål 20'!$I$26)","v":0},{"$f":"IF('Mål 20'!$J$26=\"\",0,'Mål 20'!$J$26)","v":0},{"$f":"IF('Mål 20'!$K$26=\"\",0,'Mål 20'!$K$26)","v":"00:00:00"}]
[null,null,"Mål 20",{"$f":"IF('Mål 20'!$C$27=\"\",0,'Mål 20'!$C$27)","v":0},{"$f":"IF('Mål 20'!$I$27=\"\",0,'Mål 20'!$I$27)","v":0},{"$f":"IF('Mål 20'!$J$27=\"\",0,'Mål 20'!$J$27)","v":0},{"$f":"IF('Mål 20'!$K$27=\"\",0,'Mål 20'!$K$27)","v":"00:00:00"}]

{"sheet":"Stemmeverktøy","index":6,"n_rows":53,"n_cols":24,"rows_kept":53,"merged":[[4,1,4,2],[5,1,5,2],[6,1,6,2]]}
[]
["Risikoavstemming"]
[]
[]
["Enhet"]
["Mål / krav:"]
["Risiko:"]
[]
[null,"Sannsynlighet","Konsekvens","Risikonivå"]
["Gj.snitt risikonivå",{"$f":"IF(ISERROR(AVERAGE(B13:B32)),\"\",AVERAGE(B13:B32))","v":{"v":2.6666666666666665,"d":"3"}},{"$f":"IF(ISERROR(AVERAGE(C13:C32)),\"\",AVERAGE(C13:C32))","v":{"v":2.6666666666666665,"d":"3"}},{"$f":"IF(ISERROR(C10*B10),\"\",VLOOKUP(B10,Lists!B$10:G$14,CEILING(C10-0.5,1)+1,TRUE))","v":"Høy"},{"$nulls":16},{"$f":"IF(C10=\"\",-10,C10+W31)","v":{"v":2.1666666666666665,"d":"2.17"}},{"$f":"IF(B10=\"\",-10,B10+X31)","v":{"v":2.1666666666666665,"d":"2.17"}}]
[]
["Risikoavstemming","Sannsynlighet","Konsekvens","Risikonivå",{"$nulls":16},"X-forskyv konsekv","Y-forskyv Sanns"]
["P1",4,2,{"$f":"IF(C13*B13=0,\"\",VLOOKUP(B13,Lists!B$10:G$14,CEILING(C13-0.5,1)+1,TRUE))","v":"Høy"},{"$nulls":15},"Person 1",{"$f":"IF(C13=\"\",-10,C13+U34)","v":1.15},{"$f":"IF(B13=\"\",-10,B13+V34)","v":{"v":3.5,"d":"3.50"}}]
["P2",2,2,{"$f":"IF(C14*B14=0,\"\",VLOOKUP(B14,Lists!B$10:G$14,CEILING(C14-0.5,1)+1,TRUE))","v":"Lav"},{"$nulls":15},"Person 2",1.15,1.75]
["P3",2,4,{"$f":"IF(C15*B15=0,\"\",VLOOKUP(B15,Lists!B$10:G$14,CEILING(C15-0.5,1)+1,TRUE))","v":"Høy"},{"$nulls":15},"Person 3",3.15,1.25]
["P4",null,null,{"$f":"IF(C16*B16=0,\"\",VLOOKUP(B16,Lists!B$10:G$14,CEILING(C16-0.5,1)+1,TRUE))","v":""},{"$nulls":15},"Person 4",{"v":-10,"d":"-10.00"},{"v":-10,"d":"-10.00"}]
["P5",null,null,{"$f":"IF(C17*B17=0,\"\",VLOOKUP(B17,Lists!B$10:G$14,CEILING(C17-0.5,1)+1,TRUE))","v":""},{"$nulls":15},"Person 5",{"v":-10,"d":"-10.00"},{"v":-10,"d":"-10.00"}]
["P6",null,null,{"$f":"IF(C18*B18=0,\"\",VLOOKUP(B18,Lists!B$10:G$14,CEILING(C18-0.5,1)+1,TRUE))","v":""},{"$nulls":15},"Person 6",{"v":-10,"d":"-10.00"},{"v":-10,"d":"-10.00"}]
["P7",null,null,{"$f":"IF(C19*B19=0,\"\",VLOOKUP(B19,Lists!B$10:G$14,CEILING(C19-0.5,1)+1,TRUE))","v":""},{"$nulls":15},"Person 7",{"v":-10,"d":"-10.00"},{"v":-10,"d":"-10.00"}]
["P8",null,null,{"$f":"IF(C20*B20=0,\"\",VLOOKUP(B20,Lists!B$10:G$14,CEILING(C20-0.5,1)+1,TRUE))","v":""},{"$nulls":15},"Person 8",{"v":-10,"d":"-10.00"},{"v":-10,"d":"-10.00"}]
["P9",null,null,{"$f":"IF(C21*B21=0,\"\",VLOOKUP(B21,Lists!B$10:G$14,CEILING(C21-0.5,1)+1,TRUE))","v":""},{"$nulls":15},"Person 9",{"v":-10,"d":"-10.00"},{"v":-10,"d":"-10.00"}]
["P10",null,null,{"$f":"IF(C22*B22=0,\"\",VLOOKUP(B22,Lists!B$10:G$14,CEILING(C22-0.5,1)+1,TRUE))","v":""},{"$nulls":15},"Person 10",{"v":-10,"d":"-10.00"},{"v":-10,"d":"-10.00"}]
["P11",null,null,{"$f":"IF(C23*B23=0,\"\",VLOOKUP(B23,Lists!B$10:G$14,CEILING(C23-0.5,1)+1,TRUE))","v":""},{"$nulls":15},"Person 11",{"v":-10,"d":"-10.00"},{"v":-10,"d":"-10.00"}]
["P12",null,null,{"$f":"IF(C24*B24=0,\"\",VLOOKUP(B24,Lists!B$10:G$14,CEILING(C24-0.5,1)+1,TRUE))","v":""},{"$nulls":15},"Person 12",{"v":-10,"d":"-10.00"},{"v":-10,"d":"-10.00"}]
["P13",null,null,{"$f":"IF(C25*B25=0,\"\",VLOOKUP(B25,Lists!B$10:G$14,CEILING(C25-0.5,1)+1,TRUE))","v":""},{"$nulls":15},"Person 13",{"v":-10,"d":"-10.00"},{"v":-10,"d":"-10.00"}]
["P14",null,null,{"$f":"IF(C26*B26=0,\"\",VLOOKUP(B26,Lists!B$10:G$14,CEILING(C26-0.5,1)+1,TRUE))","v":""},{"$nulls":15},"Person 14",{"v":-10,"d":"-10.00"},{"v":-10,"d":"-10.00"}]
["P15",null,null,{"$f":"IF(C27*B27=0,\"\",VLOOKUP(B27,Lists!B$10:G$14,CEILING(C27-0.5,1)+1,TRUE))","v":""},{"$nulls":15},"Person 15",{"v":-10,"d":"-10.00"},{"v":-10,"d":"-10.00"}]
["P16",null,null,{"$f":"IF(C28*B28=0,\"\",VLOOKUP(B28,Lists!B$10:G$14,CEILING(C28-0.5,1)+1,TRUE))","v":""},{"$nulls":15},"Person 16",{"v":-10,"d":"-10.00"},{"v":-10,"d":"-10.00"}]
["P17",null,null,{"$f":"IF(C29*B29=0,\"\",VLOOKUP(B29,Lists!B$10:G$14,CEILING(C29-0.5,1)+1,TRUE))","v":""},{"$nulls":15},"Person 17",{"v":-10,"d":"-10.00"},{"v":-10,"d":"-10.00"}]
["P18",null,null,{"$f":"IF(C30*B30=0,\"\",VLOOKUP(B30,Lists!B$10:G$14,CEILING(C30-0.5,1)+1,TRUE))","v":""},{"$nulls":15},"Person 18",{"v":-10,"d":"-10.00"},{"v":-10,"d":"-10.00"}]
["P19",null,null,{"$f":"IF(C31*B31=0,\"\",VLOOKUP(B31,Lists!B$10:G$14,CEILING(C31-0.5,1)+1,TRUE))","v":""},{"$nulls":15},"Person 19",{"v":-10,"d":"-10.00"},{"v":-10,"d":"-10.00"},-0.5,-0.5]
["P20",null,null,{"$f":"IF(C32*B32=0,\"\",VLOOKUP(B32,Lists!B$10:G$14,CEILING(C32-0.5,1)+1,TRUE))","v":""},{"$nulls":15},"Person 20",{"v":-10,"d":"-10.00"},{"v":-10,"d":"-10.00"}]
[{"$nulls":20},"X-forskyv","Y-forskyv"]
[{"$nulls":20},-0.85,-0.5]
[{"$nulls":20},-0.85,-0.25]
[{"$nulls":20},-0.85,-0.75]
[{"$nulls":20},-0.75,-0.5]
[{"$nulls":20},-0.75,-0.25]
[{"$nulls":20},-0.75,-0.75]
[{"$nulls":20},-0.66,-0.5]
[{"$nulls":20},-0.66,-0.25]
[{"$nulls":20},-0.66,-0.75]
[{"$nulls":20},-0.5,-0.5]
[{"$nulls":20},-0.5,-0.25]
[{"$nulls":20},-0.5,-0.75]
[{"$nulls":20},-0.33,-0.5]
[{"$nulls":20},-0.33,-0.25]
[{"$nulls":20},-0.33,-0.75]
[{"$nulls":20},-0.25,-0.5]
[{"$nulls":20},-0.25,-0.25]
[{"$nulls":20},-0.25,-0.75]
[{"$nulls":20},-0.15,-0.5]
[{"$nulls":20},-0.15,-0.25]

{"sheet":"Lists","index":7,"n_rows":14,"n_cols":7,"rows_kept":14,"merged":[[0,0,0,1],[6,0,6,6],[7,2,7,6],[9,0,13,0]]}
["Risk levels"]
[0,"Lav"]
[4,"Middels"]
[6,"Høy"]
[8,"Kritisk"]
[]
["Inversed risk matrix"]
[null,null,"Consequence"]
[null,null,0.5,1.5,2.5,3.5,4.5]
["Probability",0.5,"Lav","Lav","Middels","Høy","Høy"]
[null,1.5,"Lav","Lav","Middels","Høy","Kritisk"]
[null,2.5,"Lav","Middels","Høy","Kritisk","Kritisk"]
[null,3.5,"Middels","Høy","Høy","Kritisk","Kritisk"]
[null,4.5,"Høy","Høy","Kritisk","Kritisk","Kritisk"]

{"sheet":"Mål 1","index":8,"n_rows":59,"n_cols":30,"rows_kept":59,"merged":[[0,0,0,3],[0,4,0,6],[0,7,0,8],[0,11,0,13],[1,2,1,3],[1,5,1,6],[2,0,2,2],[2,4,2,6],[2,7,2,8],[2,11,2,13],[3,0,4,3],[3,4,3,5],[3,7,4,10],[3,11,3,12],[5,24,5,25],[5,26,5,27],[21,2,21,3],[22,2,22,3]]}
["Risikoidentifikasjon og analyse",{"$nulls":3},"Ansvarlig:",null,null,"Helen Bakke Klemoen og Bente Øverby",{"$nulls":3},"Risikomatrise, \nse under"]
["Enhet:",{"$nulls":3},"Dato:",{"$f":"IF(Forside!C4=\"\",\"\",Forside!C4)","v":""},null,"12.01.2021"]
["Mål / krav nr 1:",{"$nulls":3},"Risiko før tiltak",null,null,"Deltakere i prosessen:",{"$nulls":3},"Risiko etter tiltak"]
["Utsendelse av sakslister og protokoller innen gitte frister, samt et godt fungerede sekretariat",{"$nulls":3},"Risiko-vurdering",null,"Risiko-nivå","Helen Bakke Klemoen og Bente Øverby",{"$nulls":3},"Risiko-vurdering",null,"Risiko-nivå"]
[{"$nulls":4},"S","K",{"$nulls":5},"S","K"]
[{"$nulls":3},"Gjsn risiko for målet:",{"$f":"IF(ISERROR(AVERAGE(E8:E15)),\"\",ROUND(AVERAGE(E8:E15),0))","v":2},{"$f":"IF(ISERROR(AVERAGE(F8:F15)),\"\",ROUND(AVERAGE(F8:F15),0))","v":3},{"$f":"IF(ISERROR(E6*F6),\"\",VLOOKUP(E6,Lists!B$10:G$14,CEILING(F6-0.5,1)+1,TRUE))","v":"Middels"},{"$nulls":4},{"$f":"IF(ISERROR(AVERAGE(L8:L15)),\"\",ROUND(AVERAGE(L8:L15),0))","v":""},{"$f":"IF(ISERROR(AVERAGE(M8:M15)),\"\",ROUND(AVERAGE(M8:M15),0))","v":""},{"$f":"IF(ISERROR(L6*M6),\"\",VLOOKUP(L6,Lists!B$10:G$14,CEILING(M6-0.5,1)+1,TRUE))","v":""},{"$nulls":10},"Før tiltak",null,"Etter tiltak"]
["Risiko nr","Mulige hendelser/ risiko","Område","Eksisterende tiltak","S","K","Risiko-nivå","Risikoeier:","Nye tiltak:","Ansvarlig:","Frist:","S","K","Risiko-nivå",{"$nulls":10},"X-forskyv konsekv","Y-forskyv Sanns","X-forskyv konsekv","Y-forskyv Sanns"]
["R1",{"$nulls":5},{"$f":"IF(F8*E8=0,\"\",VLOOKUP(E8,Lists!B$10:G$14,CEILING(F8-0.5,1)+1,TRUE))","v":""},{"$nulls":6},{"$f":"IF(M8*L8=0,\"\",VLOOKUP(L8,Lists!B$10:G$14,CEILING(M8-0.5,1)+1,TRUE))","v":""},{"$nulls":10},{"$f":"IF(F8=\"\",-10,F8+#REF!)","v":{"v":-10,"d":"-10.00"}},{"$f":"IF(E8=\"\",-10,E8+#REF!)","v":{"v":-10,"d":"-10.00"}},{"$f":"IF(M8=\"\",Y8,M8+#REF!)","v":{"v":-10,"d":"-10.00"}},{"$f":"IF(L8=\"\",Z8,L8+#REF!)","v":{"v":-10,"d":"-10.00"}}]
["R2","Sykdom politisk sekretariat","Sekretær funksjon; utsending av sakslister og protokoll, behandle evt. forfall/innkalle vara","2 ansatte i det politiske sekretariatet. Arkivleder har også kjennskap til acos møte",2,2,{"$f":"IF(F9*E9=0,\"\",VLOOKUP(E9,Lists!B$10:G$14,CEILING(F9-0.5,1)+1,TRUE))","v":"Lav"},"Stableder HR og service","Grundigere opplæring av arkivleder ","Politisk sekretariat",{"$nulls":3},{"$f":"IF(M9*L9=0,\"\",VLOOKUP(L9,Lists!B$10:G$14,CEILING(M9-0.5,1)+1,TRUE))","v":""},{"$nulls":10},{"$f":"IF(F9=\"\",-10,F9+AC17)","v":1.15},{"$f":"IF(E9=\"\",-10,E9+AD17)","v":1.75},{"$f":"IF(M9=\"\",Y9,M9+AC17)","v":1.15},{"$f":"IF(L9=\"\",Z9,L9+AD17)","v":1.75}]
["R3","Sykdom politisk sekretariat","Sekretær i møte","2 ansatte i det politiske sekretariatet. Leder av råd/utvalg kan skrive protokoll.",2,1,{"$f":"IF(F10*E10=0,\"\",VLOOKUP(E10,Lists!B$10:G$14,CEILING(F10-0.5,1)+1,TRUE))","v":"Lav"},"Stableder HR og service",null,"Politisk sekretariat",{"$nulls":3},{"$f":"IF(M10*L10=0,\"\",VLOOKUP(L10,Lists!B$10:G$14,CEILING(M10-0.5,1)+1,TRUE))","v":""},{"$nulls":10},{"$f":"IF(F10=\"\",-10,F10+AC18)","v":{"v":0.15000000000000002,"d":"0.15"}},{"$f":"IF(E10=\"\",-10,E10+AD18)","v":1.25},{"$f":"IF(M10=\"\",Y10,M10+AC18)","v":{"v":0.15000000000000002,"d":"0.15"}},{"$f":"IF(L10=\"\",Z10,L10+AD18)","v":1.25}]
["R4","Internettbrudd","Produksjon og utsendelse av sakslister og protokoll","Mobilt bredbånd",3,2,{"$f":"IF(F11*E11=0,\"\",VLOOKUP(E11,Lists!B$10:G$14,CEILING(F11-0.5,1)+1,TRUE))","v":"Middels"},"Stableder Økonomi og IKT",null,"IKT",{"$nulls":3},{"$f":"IF(M11*L11=0,\"\",VLOOKUP(L11,Lists!B$10:G$14,CEILING(M11-0.5,1)+1,TRUE))","v":""},{"$nulls":10},{"$f":"IF(F11=\"\",-10,F11+AC19)","v":1.25},{"$f":"IF(E11=\"\",-10,E11+AD19)","v":{"v":2.5,"d":"2.50"}},{"$f":"IF(M11=\"\",Y11,M11+AC19)","v":1.25},{"$f":"IF(L11=\"\",Z11,L11+AD19)","v":{"v":2.5,"d":"2.50"}}]
["R12","Streik","Produksjon og utsendelse av sakslister og protokoll","Utsettelse av politisk møte",1,5,{"$f":"IF(F12*E12=0,\"\",VLOOKUP(E12,Lists!B$10:G$14,CEILING(F12-0.5,1)+1,TRUE))","v":"Høy"},"Stableder HR og service",{"$nulls":5},{"$f":"IF(M12*L12=0,\"\",VLOOKUP(L12,Lists!B$10:G$14,CEILING(M12-0.5,1)+1,TRUE))","v":""},{"$nulls":10},{"$f":"IF(F12=\"\",-10,F12+AC27)","v":{"v":4.5,"d":"4.50"}},{"$f":"IF(E12=\"\",-10,E12+AD27)","v":0.25},{"$f":"IF(M12=\"\",Y12,M12+AC27)","v":{"v":4.5,"d":"4.50"}},{"$f":"IF(L12=\"\",Z12,L12+AD27)","v":0.25}]
["R18","Datavirus","Produksjon og utsendelse av sakslister og protokoller","Oppdaterte lister over råd og utvalg er skrivet ut og lagret på papir i hylle",2,4,{"$f":"IF(F13*E13=0,\"\",VLOOKUP(E13,Lists!B$10:G$14,CEILING(F13-0.5,1)+1,TRUE))","v":"Høy"},"Stableder HR og service","Utsendelse av sakslister og protokoller på papir (dersom vi har tilgang til skrivere) og på mail. ","Politisk sekretariat",{"$nulls":3},{"$f":"IF(M13*L13=0,\"\",VLOOKUP(L13,Lists!B$10:G$14,CEILING(M13-0.5,1)+1,TRUE))","v":""},{"$nulls":10},{"$f":"IF(F13=\"\",-10,F13+AC33)","v":3.75},{"$f":"IF(E13=\"\",-10,E13+AD33)","v":1.25},{"$f":"IF(M13=\"\",Y13,M13+AC33)","v":3.75},{"$f":"IF(L13=\"\",Z13,L13+AD33)","v":1.25}]
["R19","Skrivefrister overskrides","Produksjon og utsendelse av sakslister og protokoller","Utsettelse av saker. Eventuell tilleggssaksliste",4,2,{"$f":"IF(F14*E14=0,\"\",VLOOKUP(E14,Lists!B$10:G$14,CEILING(F14-0.5,1)+1,TRUE))","v":"Høy"},"Kommunedirektør","Avkare rutiner med kommunedirektør. Utsendelse av tilleggssaksliste evt. utsette sak til neste møte","Politisk sekretariat",{"$nulls":3},{"$f":"IF(M14*L14=0,\"\",VLOOKUP(L14,Lists!B$10:G$14,CEILING(M14-0.5,1)+1,TRUE))","v":""},{"$nulls":10},1.85,{"v":3.5,"d":"3.50"},1.85,{"v":3.5,"d":"3.50"}]
["R20","Sykdom kommunedirektør","Produksjon og utsendelse av sakslister","Godkjenning av saksfremlegg delegeres ",2,2,{"$f":"IF(F15*E15=0,\"\",VLOOKUP(E15,Lists!B$10:G$14,CEILING(F15-0.5,1)+1,TRUE))","v":"Lav"},"Stableder HR og service",null,"Kommunedirektøren",{"$nulls":3},{"$f":"IF(M15*L15=0,\"\",VLOOKUP(L15,Lists!B$10:G$14,CEILING(M15-0.5,1)+1,TRUE))","v":""},{"$nulls":10},1.85,1.75,1.85,1.75]
["R21","Pandemi utrudd","Produksjon og utsendelse av sakslister og protokoller","Hjemmekontor",3,3,{"$f":"IF(F16*E16=0,\"\",VLOOKUP(E16,Lists!B$10:G$14,CEILING(F16-0.5,1)+1,TRUE))","v":"Høy"},"Kommunedirektør",null,"Arkivleder/Stavleder HR og service/Kommunedirektør",{"$nulls":3},{"$f":"IF(M16*L16=0,\"\",VLOOKUP(L16,Lists!B$10:G$14,CEILING(M16-0.5,1)+1,TRUE))","v":""},{"$nulls":14},"X-forskyv","Y-forskyv"]
["R22","Pandemi utrudd","Gjennomføring av møter","Teams møter",3,2,{"$f":"IF(F17*E17=0,\"\",VLOOKUP(E17,Lists!B$10:G$14,CEILING(F17-0.5,1)+1,TRUE))","v":"Middels"},"Kommunedirektør",null,"Kommunedirektør",{"$nulls":3},{"$f":"IF(M17*L17=0,\"\",VLOOKUP(L17,Lists!B$10:G$14,CEILING(M17-0.5,1)+1,TRUE))","v":""},{"$nulls":10},"X-Konsekvens","Y-Sannsynlighet",null,null,-0.85,-0.25]
["R23","Langvarig strømbrudd (nede telenett, ikke tilgang til skriverer/pc)","Produksjon og utsendelse av sakslister og protokoller","Utsettelse av møte eller forsinket utsendelse av sakslister/protokoller",1,3,{"$f":"IF(F18*E18=0,\"\",VLOOKUP(E18,Lists!B$10:G$14,CEILING(F18-0.5,1)+1,TRUE))","v":"Middels"},"Kommunedirektør","Hvordan skal dette kommuniseres ut? Penn og papir?","Kommunedirektør",{"$nulls":3},{"$f":"IF(M18*L18=0,\"\",VLOOKUP(L18,Lists!B$10:G$14,CEILING(M18-0.5,1)+1,TRUE))","v":""},{"$nulls":9},"Gj sn",{"$f":"IF(F6=\"\",-10,F6-0.5)","v":{"v":2.5,"d":"2.50"}},{"$f":"IF(E6=\"\",-10,E6-0.5)","v":{"v":1.5,"d":"1.50"}},null,null,-0.85,-0.75]
["R24",{"$nulls":5},{"$f":"IF(F19*E19=0,\"\",VLOOKUP(E19,Lists!B$10:G$14,CEILING(F19-0.5,1)+1,TRUE))","v":""},{"$nulls":6},{"$f":"IF(M19*L19=0,\"\",VLOOKUP(L19,Lists!B$10:G$14,CEILING(M19-0.5,1)+1,TRUE))","v":""},{"$nulls":10},{"$f":"IF(M6=\"\",Y18,M6-0.6)","v":{"v":2.5,"d":"2.50"}},{"$f":"IF(L6=\"\",Z18,L6-0.6)","v":{"v":1.5,"d":"1.50"}},null,null,-0.75,-0.5]
["R25",{"$nulls":5},{"$f":"IF(F20*E20=0,\"\",VLOOKUP(E20,Lists!B$10:G$14,CEILING(F20-0.5,1)+1,TRUE))","v":""},{"$nulls":6},{"$f":"IF(M20*L20=0,\"\",VLOOKUP(L20,Lists!B$10:G$14,CEILING(M20-0.5,1)+1,TRUE))","v":""},{"$nulls":9},{"$f":"A8","v":"R1"},{"$f":"Y8","v":{"v":-10,"d":"-10.00"}},{"$f":"Z8","v":-10},null,null,-0.75,-0.25]
["R26",{"$nulls":5},{"$f":"IF(F21*E21=0,\"\",VLOOKUP(E21,Lists!B$10:G$14,CEILING(F21-0.5,1)+1,TRUE))","v":""},{"$nulls":6},{"$f":"IF(M21*L21=0,\"\",VLOOKUP(L21,Lists!B$10:G$14,CEILING(M21-0.5,1)+1,TRUE))","v":""},{"$nulls":10},{"$f":"AA8","v":{"v":-10,"d":"-10.00"}},{"$f":"AB8","v":-10},null,null,-0.75,-0.75]
[null,null,"● = Risikonivå før tiltak",{"$nulls":20},{"$f":"A9","v":"R2"},{"$f":"Y9","v":1.15},{"$f":"Z9","v":1.75},null,null,-0.66,-0.5]
[null,null,"■ = Risikonivå etter tiltak",{"$nulls":21},{"$f":"AA9","v":1.15},{"$f":"AB9","v":1.75},null,null,-0.66,-0.25]
[{"$nulls":23},{"$f":"A10","v":"R3"},{"$f":"Y10","v":0.15000000000000002},{"$f":"Z10","v":1.25},null,null,-0.66,-0.75]
[{"$nulls":24},{"$f":"AA10","v":0.15000000000000002},{"$f":"AB10","v":1.25},null,null,-0.5,-0.5]
[{"$nulls":23},{"$f":"A11","v":"R4"},{"$f":"Y11","v":1.25},{"$f":"Z11","v":2.5},null,null,-0.5,-0.25]
[{"$nulls":24},{"$f":"AA11","v":1.25},{"$f":"AB11","v":2.5},null,null,-0.5,-0.75]
[{"$nulls":23},{"$f":"#REF!","v":{"$error":"#REF!"}},{"$f":"#REF!","v":{"$error":"#REF!"}},{"$f":"#REF!","v":{"$error":"#REF!"}},null,null,-0.33,-0.5]
[{"$nulls":24},{"$f":"#REF!","v":{"$error":"#REF!"}},{"$f":"#REF!","v":{"$error":"#REF!"}},null,null,-0.33,-0.25]
[{"$nulls":23},{"$f":"#REF!","v":{"$error":"#REF!"}},{"$f":"#REF!","v":{"$error":"#REF!"}},{"$f":"#REF!","v":{"$error":"#REF!"}},null,null,-0.33,-0.75]
[{"$nulls":24},{"$f":"#REF!","v":{"$error":"#REF!"}},{"$f":"#REF!","v":{"$error":"#REF!"}},null,null,-0.25,-0.5]
[{"$nulls":23},{"$f":"#REF!","v":{"$error":"#REF!"}},{"$f":"#REF!","v":{"$error":"#REF!"}},{"$f":"#REF!","v":{"$error":"#REF!"}},null,null,-0.25,-0.25]
[{"$nulls":24},{"$f":"#REF!","v":{"$error":"#REF!"}},{"$f":"#REF!","v":{"$error":"#REF!"}},null,null,-0.25,-0.75]
[{"$nulls":23},{"$f":"#REF!","v":{"$error":"#REF!"}},{"$f":"#REF!","v":{"$error":"#REF!"}},{"$f":"#REF!","v":{"$error":"#REF!"}},null,null,-0.15,-0.5]
[{"$nulls":24},{"$f":"#REF!","v":{"$error":"#REF!"}},{"$f":"#REF!","v":{"$error":"#REF!"}},null,null,-0.15,-0.25]
[{"$nulls":23},{"$f":"#REF!","v":{"$error":"#REF!"}},{"$f":"#REF!","v":{"$error":"#REF!"}},{"$f":"#REF!","v":{"$error":"#REF!"}}]
[{"$nulls":24},{"$f":"#REF!","v":{"$error":"#REF!"}},{"$f":"#REF!","v":{"$error":"#REF!"}}]
[{"$nulls":23},{"$f":"#REF!","v":{"$error":"#REF!"}},{"$f":"#REF!","v":{"$error":"#REF!"}},{"$f":"#REF!","v":{"$error":"#REF!"}}]
[{"$nulls":24},{"$f":"#REF!","v":{"$error":"#REF!"}},{"$f":"#REF!","v":{"$error":"#REF!"}}]
[{"$nulls":23},{"$f":"#REF!","v":{"$error":"#REF!"}},{"$f":"#REF!","v":{"$error":"#REF!"}},{"$f":"#REF!","v":{"$error":"#REF!"}}]
[{"$nulls":24},{"$f":"#REF!","v":{"$error":"#REF!"}},{"$f":"#REF!","v":{"$error":"#REF!"}}]
[{"$nulls":23},{"$f":"A12","v":"R12"},{"$f":"Y12","v":{"v":4.5,"d":"4.50"}},{"$f":"Z12","v":0.25}]
[{"$nulls":24},{"$f":"AA12","v":4.5},{"$f":"AB12","v":0.25}]
[{"$nulls":23},{"$f":"#REF!","v":{"$error":"#REF!"}},{"$f":"#REF!","v":{"$error":"#REF!"}},{"$f":"#REF!","v":{"$error":"#REF!"}}]
[{"$nulls":24},{"$f":"#REF!","v":{"$error":"#REF!"}},{"$f":"#REF!","v":{"$error":"#REF!"}}]
[{"$nulls":23},{"$f":"#REF!","v":{"$error":"#REF!"}},{"$f":"#REF!","v":{"$error":"#REF!"}},{"$f":"#REF!","v":{"$error":"#REF!"}}]
[{"$nulls":24},{"$f":"#REF!","v":{"$error":"#REF!"}},{"$f":"#REF!","v":{"$error":"#REF!"}}]
[{"$nulls":23},{"$f":"#REF!","v":{"$error":"#REF!"}},{"$f":"#REF!","v":{"$error":"#REF!"}},{"$f":"#REF!","v":{"$error":"#REF!"}}]
[{"$nulls":24},{"$f":"#REF!","v":{"$error":"#REF!"}},{"$f":"#REF!","v":{"$error":"#REF!"}}]
[{"$nulls":23},{"$f":"#REF!","v":{"$error":"#REF!"}},{"$f":"#REF!","v":{"$error":"#REF!"}},{"$f":"#REF!","v":{"$error":"#REF!"}}]
[{"$nulls":24},{"$f":"#REF!","v":{"$error":"#REF!"}},{"$f":"#REF!","v":{"$error":"#REF!"}}]
[{"$nulls":23},{"$f":"#REF!","v":{"$error":"#REF!"}},{"$f":"#REF!","v":{"$error":"#REF!"}},{"$f":"#REF!","v":{"$error":"#REF!"}}]
[{"$nulls":24},{"$f":"#REF!","v":{"$error":"#REF!"}},{"$f":"#REF!","v":{"$error":"#REF!"}}]
[{"$nulls":23},{"$f":"A13","v":"R18"},{"$f":"Y13","v":3.75},{"$f":"Z13","v":1.25}]
[{"$nulls":24},{"$f":"AA13","v":3.75},{"$f":"AB13","v":1.25}]
[{"$nulls":23},{"$f":"A14","v":"R19"},{"$f":"Y14","v":1.85},{"$f":"Z14","v":{"v":3.5,"d":"3.50"}}]
[{"$nulls":24},{"$f":"AA14","v":1.85},{"$f":"AB14","v":{"v":3.5,"d":"3.50"}}]
[{"$nulls":23},{"$f":"A15","v":"R20"},{"$f":"Y15","v":1.85},{"$f":"Z15","v":1.75}]
[{"$nulls":24},{"$f":"AA15","v":1.85},{"$f":"AB15","v":1.75}]

{"sheet":"Mål 2","index":9,"n_rows":72,"n_cols":30,"rows_kept":72,"merged":[[0,0,0,3],[0,4,0,6],[0,7,0,8],[0,11,0,13],[1,2,1,3],[1,5,1,6],[1,12,1,13],[2,0,2,2],[2,4,2,6],[2,7,2,8],[2,11,2,13],[3,0,4,3],[3,4,3,5],[3,7,4,10],[3,11,3,12],[5,24,5,25],[5,26,5,27],[30,0,30,2],[31,0,32,3],[34,2,34,3],[35,2,35,3]]}
["Risikoidentifikasjon og analyse",{"$nulls":3},"Ansvarlig:",{"$nulls":6},"Risikomatrise, \nse under"]
["Enhet:",null,{"$f":"IF(Forside!C2=\"\",\"\",Forside!C2)","v":"Tjenesteområde <<tjenesteområde>>"},null,"Dato:",{"$f":"IF(Forside!C4=\"\",\"\",Forside!C4)","v":""}]
["Mål / krav nr 2:",{"$nulls":3},"Risiko før tiltak",null,null,"Deltakere i prosessen:",{"$nulls":3},"Risiko etter tiltak"]
[{"$nulls":4},"Risiko-vurdering",null,"Risiko-nivå",{"$f":"IF(Forside!C3=\"\",\"\",Forside!C3)","v":"<<deltakere>>"},{"$nulls":3},"Risiko-vurdering",null,"Risiko-nivå"]
[{"$nulls":4},"S","K",{"$nulls":5},"S","K"]
[{"$nulls":3},"Gjsn risiko for målet:",{"$f":"IF(ISERROR(AVERAGE(E8:E27)),\"\",ROUND(AVERAGE(E8:E27),0))","v":""},{"$f":"IF(ISERROR(AVERAGE(F8:F27)),\"\",ROUND(AVERAGE(F8:F27),0))","v":""},{"$f":"IF(ISERROR(E6*F6),\"\",VLOOKUP(E6,Lists!B$10:G$14,CEILING(F6-0.5,1)+1,TRUE))","v":""},{"$nulls":4},{"$f":"IF(ISERROR(AVERAGE(L8:L27)),\"\",ROUND(AVERAGE(L8:L27),0))","v":""},{"$f":"IF(ISERROR(AVERAGE(M8:M27)),\"\",ROUND(AVERAGE(M8:M27),0))","v":""},{"$f":"IF(ISERROR(L6*M6),\"\",VLOOKUP(L6,Lists!B$10:G$14,CEILING(M6-0.5,1)+1,TRUE))","v":""},{"$nulls":10},"Før tiltak",null,"Etter tiltak"]
["Risiko nr","Mulige hendelser/ risiko","Område","Eksisterende tiltak","S","K","Risiko-nivå","Risikoeier:","Nye tiltak:","Ansvarlig:","Frist:","S","K","Risiko-nivå",{"$nulls":10},"X-forskyv konsekv","Y-forskyv Sanns","X-forskyv konsekv","Y-forskyv Sanns"]
["R1",{"$nulls":5},{"$f":"IF(F8*E8=0,\"\",VLOOKUP(E8,Lists!B$10:G$14,CEILING(F8-0.5,1)+1,TRUE))","v":""},{"$nulls":6},{"$f":"IF(M8*L8=0,\"\",VLOOKUP(L8,Lists!B$10:G$14,CEILING(M8-0.5,1)+1,TRUE))","v":""},{"$nulls":10},{"$f":"IF(F8=\"\",-10,F8+AC29)","v":{"v":-10,"d":"-10.00"}},{"$f":"IF(E8=\"\",-10,E8+AD29)","v":{"v":-10,"d":"-10.00"}},{"$f":"IF(M8=\"\",Y8,M8+AC29)","v":{"v":-10,"d":"-10.00"}},{"$f":"IF(L8=\"\",Z8,L8+AD29)","v":{"v":-10,"d":"-10.00"}}]
["R2",{"$nulls":5},{"$f":"IF(F9*E9=0,\"\",VLOOKUP(E9,Lists!B$10:G$14,CEILING(F9-0.5,1)+1,TRUE))","v":""},{"$nulls":6},{"$f":"IF(M9*L9=0,\"\",VLOOKUP(L9,Lists!B$10:G$14,CEILING(M9-0.5,1)+1,TRUE))","v":""},{"$nulls":10},{"v":-10,"d":"-10.00"},{"v":-10,"d":"-10.00"},{"v":-10,"d":"-10.00"},{"v":-10,"d":"-10.00"}]
["R3",{"$nulls":5},{"$f":"IF(F10*E10=0,\"\",VLOOKUP(E10,Lists!B$10:G$14,CEILING(F10-0.5,1)+1,TRUE))","v":""},{"$nulls":6},{"$f":"IF(M10*L10=0,\"\",VLOOKUP(L10,Lists!B$10:G$14,CEILING(M10-0.5,1)+1,TRUE))","v":""},{"$nulls":10},{"v":-10,"d":"-10.00"},{"v":-10,"d":"-10.00"},{"v":-10,"d":"-10.00"},{"v":-10,"d":"-10.00"}]
["R4",{"$nulls":5},{"$f":"IF(F11*E11=0,\"\",VLOOKUP(E11,Lists!B$10:G$14,CEILING(F11-0.5,1)+1,TRUE))","v":""},{"$nulls":6},{"$f":"IF(M11*L11=0,\"\",VLOOKUP(L11,Lists!B$10:G$14,CEILING(M11-0.5,1)+1,TRUE))","v":""},{"$nulls":10},{"v":-10,"d":"-10.00"},{"v":-10,"d":"-10.00"},{"v":-10,"d":"-10.00"},{"v":-10,"d":"-10.00"}]
["R5",{"$nulls":5},{"$f":"IF(F12*E12=0,\"\",VLOOKUP(E12,Lists!B$10:G$14,CEILING(F12-0.5,1)+1,TRUE))","v":""},{"$nulls":6},{"$f":"IF(M12*L12=0,\"\",VLOOKUP(L12,Lists!B$10:G$14,CEILING(M12-0.5,1)+1,TRUE))","v":""},{"$nulls":10},{"v":-10,"d":"-10.00"},{"v":-10,"d":"-10.00"},{"v":-10,"d":"-10.00"},{"v":-10,"d":"-10.00"}]
["R6",{"$nulls":5},{"$f":"IF(F13*E13=0,\"\",VLOOKUP(E13,Lists!B$10:G$14,CEILING(F13-0.5,1)+1,TRUE))","v":""},{"$nulls":6},{"$f":"IF(M13*L13=0,\"\",VLOOKUP(L13,Lists!B$10:G$14,CEILING(M13-0.5,1)+1,TRUE))","v":""},{"$nulls":10},{"v":-10,"d":"-10.00"},{"v":-10,"d":"-10.00"},{"v":-10,"d":"-10.00"},{"v":-10,"d":"-10.00"}]
["R7",{"$nulls":5},{"$f":"IF(F14*E14=0,\"\",VLOOKUP(E14,Lists!B$10:G$14,CEILING(F14-0.5,1)+1,TRUE))","v":""},{"$nulls":6},{"$f":"IF(M14*L14=0,\"\",VLOOKUP(L14,Lists!B$10:G$14,CEILING(M14-0.5,1)+1,TRUE))","v":""},{"$nulls":10},{"v":-10,"d":"-10.00"},{"v":-10,"d":"-10.00"},{"v":-10,"d":"-10.00"},{"v":-10,"d":"-10.00"}]
["R8",{"$nulls":5},{"$f":"IF(F15*E15=0,\"\",VLOOKUP(E15,Lists!B$10:G$14,CEILING(F15-0.5,1)+1,TRUE))","v":""},{"$nulls":6},{"$f":"IF(M15*L15=0,\"\",VLOOKUP(L15,Lists!B$10:G$14,CEILING(M15-0.5,1)+1,TRUE))","v":""},{"$nulls":10},{"v":-10,"d":"-10.00"},{"v":-10,"d":"-10.00"},{"v":-10,"d":"-10.00"},{"v":-10,"d":"-10.00"}]
["R9",{"$nulls":5},{"$f":"IF(F16*E16=0,\"\",VLOOKUP(E16,Lists!B$10:G$14,CEILING(F16-0.5,1)+1,TRUE))","v":""},{"$nulls":6},{"$f":"IF(M16*L16=0,\"\",VLOOKUP(L16,Lists!B$10:G$14,CEILING(M16-0.5,1)+1,TRUE))","v":""},{"$nulls":10},{"v":-10,"d":"-10.00"},{"v":-10,"d":"-10.00"},{"v":-10,"d":"-10.00"},{"v":-10,"d":"-10.00"}]
["R10",{"$nulls":5},{"$f":"IF(F17*E17=0,\"\",VLOOKUP(E17,Lists!B$10:G$14,CEILING(F17-0.5,1)+1,TRUE))","v":""},{"$nulls":6},{"$f":"IF(M17*L17=0,\"\",VLOOKUP(L17,Lists!B$10:G$14,CEILING(M17-0.5,1)+1,TRUE))","v":""},{"$nulls":10},{"v":-10,"d":"-10.00"},{"v":-10,"d":"-10.00"},{"v":-10,"d":"-10.00"},{"v":-10,"d":"-10.00"}]
["R11",{"$nulls":5},{"$f":"IF(F18*E18=0,\"\",VLOOKUP(E18,Lists!B$10:G$14,CEILING(F18-0.5,1)+1,TRUE))","v":""},{"$nulls":6},{"$f":"IF(M18*L18=0,\"\",VLOOKUP(L18,Lists!B$10:G$14,CEILING(M18-0.5,1)+1,TRUE))","v":""},{"$nulls":10},{"v":-10,"d":"-10.00"},{"v":-10,"d":"-10.00"},{"v":-10,"d":"-10.00"},{"v":-10,"d":"-10.00"}]
["R12",{"$nulls":5},{"$f":"IF(F19*E19=0,\"\",VLOOKUP(E19,Lists!B$10:G$14,CEILING(F19-0.5,1)+1,TRUE))","v":""},{"$nulls":6},{"$f":"IF(M19*L19=0,\"\",VLOOKUP(L19,Lists!B$10:G$14,CEILING(M19-0.5,1)+1,TRUE))","v":""},{"$nulls":10},{"v":-10,"d":"-10.00"},{"v":-10,"d":"-10.00"},{"v":-10,"d":"-10.00"},{"v":-10,"d":"-10.00"}]
["R13",{"$nulls":5},{"$f":"IF(F20*E20=0,\"\",VLOOKUP(E20,Lists!B$10:G$14,CEILING(F20-0.5,1)+1,TRUE))","v":""},{"$nulls":6},{"$f":"IF(M20*L20=0,\"\",VLOOKUP(L20,Lists!B$10:G$14,CEILING(M20-0.5,1)+1,TRUE))","v":""},{"$nulls":10},{"v":-10,"d":"-10.00"},{"v":-10,"d":"-10.00"},{"v":-10,"d":"-10.00"},{"v":-10,"d":"-10.00"}]
["R14",{"$nulls":5},{"$f":"IF(F21*E21=0,\"\",VLOOKUP(E21,Lists!B$10:G$14,CEILING(F21-0.5,1)+1,TRUE))","v":""},{"$nulls":6},{"$f":"IF(M21*L21=0,\"\",VLOOKUP(L21,Lists!B$10:G$14,CEILING(M21-0.5,1)+1,TRUE))","v":""},{"$nulls":10},{"v":-10,"d":"-10.00"},{"v":-10,"d":"-10.00"},{"v":-10,"d":"-10.00"},{"v":-10,"d":"-10.00"}]
["R15",{"$nulls":5},{"$f":"IF(F22*E22=0,\"\",VLOOKUP(E22,Lists!B$10:G$14,CEILING(F22-0.5,1)+1,TRUE))","v":""},{"$nulls":6},{"$f":"IF(M22*L22=0,\"\",VLOOKUP(L22,Lists!B$10:G$14,CEILING(M22-0.5,1)+1,TRUE))","v":""},{"$nulls":10},{"v":-10,"d":"-10.00"},{"v":-10,"d":"-10.00"},{"v":-10,"d":"-10.00"},{"v":-10,"d":"-10.00"}]
["R16",{"$nulls":5},{"$f":"IF(F23*E23=0,\"\",VLOOKUP(E23,Lists!B$10:G$14,CEILING(F23-0.5,1)+1,TRUE))","v":""},{"$nulls":6},{"$f":"IF(M23*L23=0,\"\",VLOOKUP(L23,Lists!B$10:G$14,CEILING(M23-0.5,1)+1,TRUE))","v":""},{"$nulls":10},{"v":-10,"d":"-10.00"},{"v":-10,"d":"-10.00"},{"v":-10,"d":"-10.00"},{"v":-10,"d":"-10.00"}]
["R17",{"$nulls":5},{"$f":"IF(F24*E24=0,\"\",VLOOKUP(E24,Lists!B$10:G$14,CEILING(F24-0.5,1)+1,TRUE))","v":""},{"$nulls":6},{"$f":"IF(M24*L24=0,\"\",VLOOKUP(L24,Lists!B$10:G$14,CEILING(M24-0.5,1)+1,TRUE))","v":""},{"$nulls":10},{"v":-10,"d":"-10.00"},{"v":-10,"d":"-10.00"},{"v":-10,"d":"-10.00"},{"v":-10,"d":"-10.00"}]
["R18",{"$nulls":5},{"$f":"IF(F25*E25=0,\"\",VLOOKUP(E25,Lists!B$10:G$14,CEILING(F25-0.5,1)+1,TRUE))","v":""},{"$nulls":6},{"$f":"IF(M25*L25=0,\"\",VLOOKUP(L25,Lists!B$10:G$14,CEILING(M25-0.5,1)+1,TRUE))","v":""},{"$nulls":10},{"v":-10,"d":"-10.00"},{"v":-10,"d":"-10.00"},{"v":-10,"d":"-10.00"},{"v":-10,"d":"-10.00"}]
["R19",{"$nulls":5},{"$f":"IF(F26*E26=0,\"\",VLOOKUP(E26,Lists!B$10:G$14,CEILING(F26-0.5,1)+1,TRUE))","v":""},{"$nulls":6},{"$f":"IF(M26*L26=0,\"\",VLOOKUP(L26,Lists!B$10:G$14,CEILING(M26-0.5,1)+1,TRUE))","v":""},{"$nulls":10},{"v":-10,"d":"-10.00"},{"v":-10,"d":"-10.00"},{"v":-10,"d":"-10.00"},{"v":-10,"d":"-10.00"}]
["R20",{"$nulls":5},{"$f":"IF(F27*E27=0,\"\",VLOOKUP(E27,Lists!B$10:G$14,CEILING(F27-0.5,1)+1,TRUE))","v":""},{"$nulls":6},{"$f":"IF(M27*L27=0,\"\",VLOOKUP(L27,Lists!B$10:G$14,CEILING(M27-0.5,1)+1,TRUE))","v":""},{"$nulls":10},{"v":-10,"d":"-10.00"},{"v":-10,"d":"-10.00"},{"v":-10,"d":"-10.00"},{"v":-10,"d":"-10.00"}]
[{"$nulls":28},"X-forskyv","Y-forskyv"]
[{"$nulls":28},-0.85,-0.5]
[{"$nulls":24},"X-Konsekvens","Y-Sannsynlighet",null,null,-0.85,-0.25]
[{"$f":"A3","v":"Mål / krav nr 2:"},{"$nulls":22},"Gj sn",{"$f":"IF(F6=\"\",-10,F6-0.5)","v":{"v":-10,"d":"-10.00"}},{"$f":"IF(E6=\"\",-10,E6-0.5)","v":{"v":-10,"d":"-10.00"}},null,null,-0.85,-0.75]
[{"$f":"IF(A4=\"\",\"\",A4)","v":""},{"$nulls":23},{"$f":"IF(M6=\"\",Y31,M6-0.6)","v":{"v":-10,"d":"-10.00"}},{"$f":"IF(L6=\"\",Z31,L6-0.6)","v":{"v":-10,"d":"-10.00"}},null,null,-0.75,-0.5]
[{"$nulls":23},{"$f":"A8","v":"R1"},{"$f":"Y8","v":{"v":-10,"d":"-10.00"}},{"$f":"Z8","v":-10},null,null,-0.75,-0.25]
[null,null,"Når risikovurdering før og etter tiltak er utfylt er:",{"$nulls":21},{"$f":"AA8","v":{"v":-10,"d":"-10.00"}},{"$f":"AB8","v":-10},null,null,-0.75,-0.75]
[null,null,"● = Risikonivå før tiltak",{"$nulls":20},{"$f":"A9","v":"R2"},{"$f":"Y9","v":-10},{"$f":"Z9","v":-10},null,null,-0.66,-0.5]
[null,null,"■ = Risikonivå etter tiltak",{"$nulls":21},{"$f":"AA9","v":{"v":-10,"d":"-10.00"}},{"$f":"AB9","v":-10},null,null,-0.66,-0.25]
[{"$nulls":23},{"$f":"A10","v":"R3"},{"$f":"Y10","v":-10},{"$f":"Z10","v":-10},null,null,-0.66,-0.75]
[{"$nulls":24},{"$f":"AA10","v":-10},{"$f":"AB10","v":-10},null,null,-0.5,-0.5]
[{"$nulls":23},{"$f":"A11","v":"R4"},{"$f":"Y11","v":-10},{"$f":"Z11","v":-10},null,null,-0.5,-0.25]
[{"$nulls":24},{"$f":"AA11","v":-10},{"$f":"AB11","v":-10},null,null,-0.5,-0.75]
[{"$nulls":23},{"$f":"A12","v":"R5"},{"$f":"Y12","v":-10},{"$f":"Z12","v":-10},null,null,-0.33,-0.5]
[{"$nulls":24},{"$f":"AA12","v":-10},{"$f":"AB12","v":-10},null,null,-0.33,-0.25]
[{"$nulls":23},{"$f":"A13","v":"R6"},{"$f":"Y13","v":-10},{"$f":"Z13","v":-10},null,null,-0.33,-0.75]
[{"$nulls":24},{"$f":"AA13","v":-10},{"$f":"AB13","v":-10},null,null,-0.25,-0.5]
[{"$nulls":23},{"$f":"A14","v":"R7"},{"$f":"Y14","v":-10},{"$f":"Z14","v":-10},null,null,-0.25,-0.25]
[{"$nulls":24},{"$f":"AA14","v":-10},{"$f":"AB14","v":-10},null,null,-0.25,-0.75]
[{"$nulls":23},{"$f":"A15","v":"R8"},{"$f":"Y15","v":-10},{"$f":"Z15","v":-10},null,null,-0.15,-0.5]
[{"$nulls":24},{"$f":"AA15","v":-10},{"$f":"AB15","v":-10},null,null,-0.15,-0.25]
[{"$nulls":23},{"$f":"A16","v":"R9"},{"$f":"Y16","v":-10},{"$f":"Z16","v":-10}]
[{"$nulls":24},{"$f":"AA16","v":-10},{"$f":"AB16","v":-10}]
[{"$nulls":23},{"$f":"A17","v":"R10"},{"$f":"Y17","v":-10},{"$f":"Z17","v":-10}]
[{"$nulls":24},{"$f":"AA17","v":-10},{"$f":"AB17","v":-10}]
[{"$nulls":23},{"$f":"A18","v":"R11"},{"$f":"Y18","v":-10},{"$f":"Z18","v":-10}]
[{"$nulls":24},{"$f":"AA18","v":-10},{"$f":"AB18","v":-10}]
[{"$nulls":23},{"$f":"A19","v":"R12"},{"$f":"Y19","v":{"v":-10,"d":"-10.00"}},{"$f":"Z19","v":-10}]
[{"$nulls":24},{"$f":"AA19","v":-10},{"$f":"AB19","v":-10}]
[{"$nulls":23},{"$f":"A20","v":"R13"},{"$f":"Y20","v":-10},{"$f":"Z20","v":-10}]
[{"$nulls":24},{"$f":"AA20","v":-10},{"$f":"AB20","v":-10}]
[{"$nulls":23},{"$f":"A21","v":"R14"},{"$f":"Y21","v":-10},{"$f":"Z21","v":-10}]
[{"$nulls":24},{"$f":"AA21","v":-10},{"$f":"AB21","v":-10}]
[{"$nulls":23},{"$f":"A22","v":"R15"},{"$f":"Y22","v":-10},{"$f":"Z22","v":-10}]
[{"$nulls":24},{"$f":"AA22","v":-10},{"$f":"AB22","v":-10}]
[{"$nulls":23},{"$f":"A23","v":"R16"},{"$f":"Y23","v":{"v":-10,"d":"-10.00"}},{"$f":"Z23","v":{"v":-10,"d":"-10.00"}}]
[{"$nulls":24},{"$f":"AA23","v":{"v":-10,"d":"-10.00"}},{"$f":"AB23","v":{"v":-10,"d":"-10.00"}}]
[{"$nulls":23},{"$f":"A24","v":"R17"},{"$f":"Y24","v":{"v":-10,"d":"-10.00"}},{"$f":"Z24","v":{"v":-10,"d":"-10.00"}}]
[{"$nulls":24},{"$f":"AA24","v":{"v":-10,"d":"-10.00"}},{"$f":"AB24","v":{"v":-10,"d":"-10.00"}}]
[{"$nulls":23},{"$f":"A25","v":"R18"},{"$f":"Y25","v":{"v":-10,"d":"-10.00"}},{"$f":"Z25","v":{"v":-10,"d":"-10.00"}}]
[{"$nulls":24},{"$f":"AA25","v":{"v":-10,"d":"-10.00"}},{"$f":"AB25","v":{"v":-10,"d":"-10.00"}}]
[{"$nulls":23},{"$f":"A26","v":"R19"},{"$f":"Y26","v":{"v":-10,"d":"-10.00"}},{"$f":"Z26","v":{"v":-10,"d":"-10.00"}}]
[{"$nulls":24},{"$f":"AA26","v":{"v":-10,"d":"-10.00"}},{"$f":"AB26","v":{"v":-10,"d":"-10.00"}}]
[{"$nulls":23},{"$f":"A27","v":"R20"},{"$f":"Y27","v":{"v":-10,"d":"-10.00"}},{"$f":"Z27","v":{"v":-10,"d":"-10.00"}}]
[{"$nulls":24},{"$f":"AA27","v":{"v":-10,"d":"-10.00"}},{"$f":"AB27","v":{"v":-10,"d":"-10.00"}}]

{"sheet":"Mål 3","index":10,"n_rows":72,"n_cols":30,"rows_kept":72,"merged":[[0,0,0,3],[0,4,0,6],[0,7,0,8],[0,11,0,13],[1,2,1,3],[1,5,1,6],[1,12,1,13],[2,0,2,2],[2,4,2,6],[2,7,2,8],[2,11,2,13],[3,0,4,3],[3,4,3,5],[3,7,4,10],[3,11,3,12],[5,24,5,25],[5,26,5,27],[30,0,30,2],[31,0,32,3],[34,2,34,3],[35,2,35,3]]}
["Risikoidentifikasjon og analyse",{"$nulls":3},"Ansvarlig:",{"$nulls":6},"Risikomatrise, \nse under"]
["Enhet:",null,{"$f":"IF(Forside!C2=\"\",\"\",Forside!C2)","v":"Tjenesteområde <<tjenesteområde>>"},null,"Dato:",{"$f":"IF(Forside!C4=\"\",\"\",Forside!C4)","v":""}]
["Mål / krav nr 3:",{"$nulls":3},"Risiko før tiltak",null,null,"Deltakere i prosessen:",{"$nulls":3},"Risiko etter tiltak"]
[{"$nulls":4},"Risiko-vurdering",null,"Risiko-nivå",{"$f":"IF(Forside!C3=\"\",\"\",Forside!C3)","v":"<<deltakere>>"},{"$nulls":3},"Risiko-vurdering",null,"Risiko-nivå"]
[{"$nulls":4},"S","K",{"$nulls":5},"S","K"]
[{"$nulls":3},"Gjsn risiko for målet:",{"$f":"IF(ISERROR(AVERAGE(E8:E27)),\"\",ROUND(AVERAGE(E8:E27),0))","v":""},{"$f":"IF(ISERROR(AVERAGE(F8:F27)),\"\",ROUND(AVERAGE(F8:F27),0))","v":""},{"$f":"IF(ISERROR(E6*F6),\"\",VLOOKUP(E6,Lists!B$10:G$14,CEILING(F6-0.5,1)+1,TRUE))","v":""},{"$nulls":4},{"$f":"IF(ISERROR(AVERAGE(L8:L27)),\"\",ROUND(AVERAGE(L8:L27),0))","v":""},{"$f":"IF(ISERROR(AVERAGE(M8:M27)),\"\",ROUND(AVERAGE(M8:M27),0))","v":""},{"$f":"IF(ISERROR(L6*M6),\"\",VLOOKUP(L6,Lists!B$10:G$14,CEILING(M6-0.5,1)+1,TRUE))","v":""},{"$nulls":10},"Før tiltak",null,"Etter tiltak"]
["Risiko nr","Mulige hendelser/ risiko","Område","Eksisterende tiltak","S","K","Risiko-nivå","Risikoeier:","Nye tiltak:","Ansvarlig:","Frist:","S","K","Risiko-nivå",{"$nulls":10},"X-forskyv konsekv","Y-forskyv Sanns","X-forskyv konsekv","Y-forskyv Sanns"]
["R1",{"$nulls":5},{"$f":"IF(F8*E8=0,\"\",VLOOKUP(E8,Lists!B$10:G$14,CEILING(F8-0.5,1)+1,TRUE))","v":""},{"$nulls":6},{"$f":"IF(M8*L8=0,\"\",VLOOKUP(L8,Lists!B$10:G$14,CEILING(M8-0.5,1)+1,TRUE))","v":""},{"$nulls":10},{"$f":"IF(F8=\"\",-10,F8+AC29)","v":{"v":-10,"d":"-10.00"}},{"$f":"IF(E8=\"\",-10,E8+AD29)","v":{"v":-10,"d":"-10.00"}},{"$f":"IF(M8=\"\",Y8,M8+AC29)","v":{"v":-10,"d":"-10.00"}},{"$f":"IF(L8=\"\",Z8,L8+AD29)","v":{"v":-10,"d":"-10.00"}}]
["R2",{"$nulls":5},{"$f":"IF(F9*E9=0,\"\",VLOOKUP(E9,Lists!B$10:G$14,CEILING(F9-0.5,1)+1,TRUE))","v":""},{"$nulls":6},{"$f":"IF(M9*L9=0,\"\",VLOOKUP(L9,Lists!B$10:G$14,CEILING(M9-0.5,1)+1,TRUE))","v":""},{"$nulls":10},{"v":-10,"d":"-10.00"},{"v":-10,"d":"-10.00"},{"v":-10,"d":"-10.00"},{"v":-10,"d":"-10.00"}]
["R3",{"$nulls":5},{"$f":"IF(F10*E10=0,\"\",VLOOKUP(E10,Lists!B$10:G$14,CEILING(F10-0.5,1)+1,TRUE))","v":""},{"$nulls":6},{"$f":"IF(M10*L10=0,\"\",VLOOKUP(L10,Lists!B$10:G$14,CEILING(M10-0.5,1)+1,TRUE))","v":""},{"$nulls":10},{"v":-10,"d":"-10.00"},{"v":-10,"d":"-10.00"},{"v":-10,"d":"-10.00"},{"v":-10,"d":"-10.00"}]
["R4",{"$nulls":5},{"$f":"IF(F11*E11=0,\"\",VLOOKUP(E11,Lists!B$10:G$14,CEILING(F11-0.5,1)+1,TRUE))","v":""},{"$nulls":6},{"$f":"IF(M11*L11=0,\"\",VLOOKUP(L11,Lists!B$10:G$14,CEILING(M11-0.5,1)+1,TRUE))","v":""},{"$nulls":10},{"v":-10,"d":"-10.00"},{"v":-10,"d":"-10.00"},{"v":-10,"d":"-10.00"},{"v":-10,"d":"-10.00"}]
["R5",{"$nulls":5},{"$f":"IF(F12*E12=0,\"\",VLOOKUP(E12,Lists!B$10:G$14,CEILING(F12-0.5,1)+1,TRUE))","v":""},{"$nulls":6},{"$f":"IF(M12*L12=0,\"\",VLOOKUP(L12,Lists!B$10:G$14,CEILING(M12-0.5,1)+1,TRUE))","v":""},{"$nulls":10},{"v":-10,"d":"-10.00"},{"v":-10,"d":"-10.00"},{"v":-10,"d":"-10.00"},{"v":-10,"d":"-10.00"}]
["R6",{"$nulls":5},{"$f":"IF(F13*E13=0,\"\",VLOOKUP(E13,Lists!B$10:G$14,CEILING(F13-0.5,1)+1,TRUE))","v":""},{"$nulls":6},{"$f":"IF(M13*L13=0,\"\",VLOOKUP(L13,Lists!B$10:G$14,CEILING(M13-0.5,1)+1,TRUE))","v":""},{"$nulls":10},{"v":-10,"d":"-10.00"},{"v":-10,"d":"-10.00"},{"v":-10,"d":"-10.00"},{"v":-10,"d":"-10.00"}]
["R7",{"$nulls":5},{"$f":"IF(F14*E14=0,\"\",VLOOKUP(E14,Lists!B$10:G$14,CEILING(F14-0.5,1)+1,TRUE))","v":""},{"$nulls":6},{"$f":"IF(M14*L14=0,\"\",VLOOKUP(L14,Lists!B$10:G$14,CEILING(M14-0.5,1)+1,TRUE))","v":""},{"$nulls":10},{"v":-10,"d":"-10.00"},{"v":-10,"d":"-10.00"},{"v":-10,"d":"-10.00"},{"v":-10,"d":"-10.00"}]
["R8",{"$nulls":5},{"$f":"IF(F15*E15=0,\"\",VLOOKUP(E15,Lists!B$10:G$14,CEILING(F15-0.5,1)+1,TRUE))","v":""},{"$nulls":6},{"$f":"IF(M15*L15=0,\"\",VLOOKUP(L15,Lists!B$10:G$14,CEILING(M15-0.5,1)+1,TRUE))","v":""},{"$nulls":10},{"v":-10,"d":"-10.00"},{"v":-10,"d":"-10.00"},{"v":-10,"d":"-10.00"},{"v":-10,"d":"-10.00"}]
["R9",{"$nulls":5},{"$f":"IF(F16*E16=0,\"\",VLOOKUP(E16,Lists!B$10:G$14,CEILING(F16-0.5,1)+1,TRUE))","v":""},{"$nulls":6},{"$f":"IF(M16*L16=0,\"\",VLOOKUP(L16,Lists!B$10:G$14,CEILING(M16-0.5,1)+1,TRUE))","v":""},{"$nulls":10},{"v":-10,"d":"-10.00"},{"v":-10,"d":"-10.00"},{"v":-10,"d":"-10.00"},{"v":-10,"d":"-10.00"}]
["R10",{"$nulls":5},{"$f":"IF(F17*E17=0,\"\",VLOOKUP(E17,Lists!B$10:G$14,CEILING(F17-0.5,1)+1,TRUE))","v":""},{"$nulls":6},{"$f":"IF(M17*L17=0,\"\",VLOOKUP(L17,Lists!B$10:G$14,CEILING(M17-0.5,1)+1,TRUE))","v":""},{"$nulls":10},{"v":-10,"d":"-10.00"},{"v":-10,"d":"-10.00"},{"v":-10,"d":"-10.00"},{"v":-10,"d":"-10.00"}]
["R11",{"$nulls":5},{"$f":"IF(F18*E18=0,\"\",VLOOKUP(E18,Lists!B$10:G$14,CEILING(F18-0.5,1)+1,TRUE))","v":""},{"$nulls":6},{"$f":"IF(M18*L18=0,\"\",VLOOKUP(L18,Lists!B$10:G$14,CEILING(M18-0.5,1)+1,TRUE))","v":""},{"$nulls":10},{"v":-10,"d":"-10.00"},{"v":-10,"d":"-10.00"},{"v":-10,"d":"-10.00"},{"v":-10,"d":"-10.00"}]
["R12",{"$nulls":5},{"$f":"IF(F19*E19=0,\"\",VLOOKUP(E19,Lists!B$10:G$14,CEILING(F19-0.5,1)+1,TRUE))","v":""},{"$nulls":6},{"$f":"IF(M19*L19=0,\"\",VLOOKUP(L19,Lists!B$10:G$14,CEILING(M19-0.5,1)+1,TRUE))","v":""},{"$nulls":10},{"v":-10,"d":"-10.00"},{"v":-10,"d":"-10.00"},{"v":-10,"d":"-10.00"},{"v":-10,"d":"-10.00"}]
["R13",{"$nulls":5},{"$f":"IF(F20*E20=0,\"\",VLOOKUP(E20,Lists!B$10:G$14,CEILING(F20-0.5,1)+1,TRUE))","v":""},{"$nulls":6},{"$f":"IF(M20*L20=0,\"\",VLOOKUP(L20,Lists!B$10:G$14,CEILING(M20-0.5,1)+1,TRUE))","v":""},{"$nulls":10},{"v":-10,"d":"-10.00"},{"v":-10,"d":"-10.00"},{"v":-10,"d":"-10.00"},{"v":-10,"d":"-10.00"}]
["R14",{"$nulls":5},{"$f":"IF(F21*E21=0,\"\",VLOOKUP(E21,Lists!B$10:G$14,CEILING(F21-0.5,1)+1,TRUE))","v":""},{"$nulls":6},{"$f":"IF(M21*L21=0,\"\",VLOOKUP(L21,Lists!B$10:G$14,CEILING(M21-0.5,1)+1,TRUE))","v":""},{"$nulls":10},{"v":-10,"d":"-10.00"},{"v":-10,"d":"-10.00"},{"v":-10,"d":"-10.00"},{"v":-10,"d":"-10.00"}]
["R15",{"$nulls":5},{"$f":"IF(F22*E22=0,\"\",VLOOKUP(E22,Lists!B$10:G$14,CEILING(F22-0.5,1)+1,TRUE))","v":""},{"$nulls":6},{"$f":"IF(M22*L22=0,\"\",VLOOKUP(L22,Lists!B$10:G$14,CEILING(M22-0.5,1)+1,TRUE))","v":""},{"$nulls":10},{"v":-10,"d":"-10.00"},{"v":-10,"d":"-10.00"},{"v":-10,"d":"-10.00"},{"v":-10,"d":"-10.00"}]
["R16",{"$nulls":5},{"$f":"IF(F23*E23=0,\"\",VLOOKUP(E23,Lists!B$10:G$14,CEILING(F23-0.5,1)+1,TRUE))","v":""},{"$nulls":6},{"$f":"IF(M23*L23=0,\"\",VLOOKUP(L23,Lists!B$10:G$14,CEILING(M23-0.5,1)+1,TRUE))","v":""},{"$nulls":10},{"v":-10,"d":"-10.00"},{"v":-10,"d":"-10.00"},{"v":-10,"d":"-10.00"},{"v":-10,"d":"-10.00"}]
["R17",{"$nulls":5},{"$f":"IF(F24*E24=0,\"\",VLOOKUP(E24,Lists!B$10:G$14,CEILING(F24-0.5,1)+1,TRUE))","v":""},{"$nulls":6},{"$f":"IF(M24*L24=0,\"\",VLOOKUP(L24,Lists!B$10:G$14,CEILING(M24-0.5,1)+1,TRUE))","v":""},{"$nulls":10},{"v":-10,"d":"-10.00"},{"v":-10,"d":"-10.00"},{"v":-10,"d":"-10.00"},{"v":-10,"d":"-10.00"}]
["R18",{"$nulls":5},{"$f":"IF(F25*E25=0,\"\",VLOOKUP(E25,Lists!B$10:G$14,CEILING(F25-0.5,1)+1,TRUE))","v":""},{"$nulls":6},{"$f":"IF(M25*L25=0,\"\",VLOOKUP(L25,Lists!B$10:G$14,CEILING(M25-0.5,1)+1,TRUE))","v":""},{"$nulls":10},{"v":-10,"d":"-10.00"},{"v":-10,"d":"-10.00"},{"v":-10,"d":"-10.00"},{"v":-10,"d":"-10.00"}]
["R19",{"$nulls":5},{"$f":"IF(F26*E26=0,\"\",VLOOKUP(E26,Lists!B$10:G$14,CEILING(F26-0.5,1)+1,TRUE))","v":""},{"$nulls":6},{"$f":"IF(M26*L26=0,\"\",VLOOKUP(L26,Lists!B$10:G$14,CEILING(M26-0.5,1)+1,TRUE))","v":""},{"$nulls":10},{"v":-10,"d":"-10.00"},{"v":-10,"d":"-10.00"},{"v":-10,"d":"-10.00"},{"v":-10,"d":"-10.00"}]
["R20",{"$nulls":5},{"$f":"IF(F27*E27=0,\"\",VLOOKUP(E27,Lists!B$10:G$14,CEILING(F27-0.5,1)+1,TRUE))","v":""},{"$nulls":6},{"$f":"IF(M27*L27=0,\"\",VLOOKUP(L27,Lists!B$10:G$14,CEILING(M27-0.5,1)+1,TRUE))","v":""},{"$nulls":10},{"v":-10,"d":"-10.00"},{"v":-10,"d":"-10.00"},{"v":-10,"d":"-10.00"},{"v":-10,"d":"-10.00"}]
[{"$nulls":28},"X-forskyv","Y-forskyv"]
[{"$nulls":28},-0.85,-0.5]
[{"$nulls":24},"X-Konsekvens","Y-Sannsynlighet",null,null,-0.85,-0.25]
[{"$f":"A3","v":"Mål / krav nr 3:"},{"$nulls":22},"Gj sn",{"$f":"IF(F6=\"\",-10,F6-0.5)","v":{"v":-10,"d":"-10.00"}},{"$f":"IF(E6=\"\",-10,E6-0.5)","v":{"v":-10,"d":"-10.00"}},null,null,-0.85,-0.75]
[{"$f":"IF(A4=\"\",\"\",A4)","v":""},{"$nulls":23},{"$f":"IF(M6=\"\",Y31,M6-0.6)","v":{"v":-10,"d":"-10.00"}},{"$f":"IF(L6=\"\",Z31,L6-0.6)","v":{"v":-10,"d":"-10.00"}},null,null,-0.75,-0.5]
[{"$nulls":23},{"$f":"A8","v":"R1"},{"$f":"Y8","v":{"v":-10,"d":"-10.00"}},{"$f":"Z8","v":-10},null,null,-0.75,-0.25]
[null,null,"Når risikovurdering før og etter tiltak er utfylt er:",{"$nulls":21},{"$f":"AA8","v":{"v":-10,"d":"-10.00"}},{"$f":"AB8","v":-10},null,null,-0.75,-0.75]
[null,null,"● = Risikonivå før tiltak",{"$nulls":20},{"$f":"A9","v":"R2"},{"$f":"Y9","v":-10},{"$f":"Z9","v":-10},null,null,-0.66,-0.5]
[null,null,"■ = Risikonivå etter tiltak",{"$nulls":21},{"$f":"AA9","v":{"v":-10,"d":"-10.00"}},{"$f":"AB9","v":-10},null,null,-0.66,-0.25]
[{"$nulls":23},{"$f":"A10","v":"R3"},{"$f":"Y10","v":-10},{"$f":"Z10","v":-10},null,null,-0.66,-0.75]
[{"$nulls":24},{"$f":"AA10","v":-10},{"$f":"AB10","v":-10},null,null,-0.5,-0.5]
[{"$nulls":23},{"$f":"A11","v":"R4"},{"$f":"Y11","v":-10},{"$f":"Z11","v":-10},null,null,-0.5,-0.25]
[{"$nulls":24},{"$f":"AA11","v":-10},{"$f":"AB11","v":-10},null,null,-0.5,-0.75]
[{"$nulls":23},{"$f":"A12","v":"R5"},{"$f":"Y12","v":-10},{"$f":"Z12","v":-10},null,null,-0.33,-0.5]
[{"$nulls":24},{"$f":"AA12","v":-10},{"$f":"AB12","v":-10},null,null,-0.33,-0.25]
[{"$nulls":23},{"$f":"A13","v":"R6"},{"$f":"Y13","v":-10},{"$f":"Z13","v":-10},null,null,-0.33,-0.75]
[{"$nulls":24},{"$f":"AA13","v":-10},{"$f":"AB13","v":-10},null,null,-0.25,-0.5]
[{"$nulls":23},{"$f":"A14","v":"R7"},{"$f":"Y14","v":-10},{"$f":"Z14","v":-10},null,null,-0.25,-0.25]
[{"$nulls":24},{"$f":"AA14","v":-10},{"$f":"AB14","v":-10},null,null,-0.25,-0.75]
[{"$nulls":23},{"$f":"A15","v":"R8"},{"$f":"Y15","v":-10},{"$f":"Z15","v":-10},null,null,-0.15,-0.5]
[{"$nulls":24},{"$f":"AA15","v":-10},{"$f":"AB15","v":-10},null,null,-0.15,-0.25]
[{"$nulls":23},{"$f":"A16","v":"R9"},{"$f":"Y16","v":-10},{"$f":"Z16","v":-10}]
[{"$nulls":24},{"$f":"AA16","v":-10},{"$f":"AB16","v":-10}]
[{"$nulls":23},{"$f":"A17","v":"R10"},{"$f":"Y17","v":-10},{"$f":"Z17","v":-10}]
[{"$nulls":24},{"$f":"AA17","v":-10},{"$f":"AB17","v":-10}]
[{"$nulls":23},{"$f":"A18","v":"R11"},{"$f":"Y18","v":-10},{"$f":"Z18","v":-10}]
[{"$nulls":24},{"$f":"AA18","v":-10},{"$f":"AB18","v":-10}]
[{"$nulls":23},{"$f":"A19","v":"R12"},{"$f":"Y19","v":{"v":-10,"d":"-10.00"}},{"$f":"Z19","v":-10}]
[{"$nulls":24},{"$f":"AA19","v":-10},{"$f":"AB19","v":-10}]
[{"$nulls":23},{"$f":"A20","v":"R13"},{"$f":"Y20","v":-10},{"$f":"Z20","v":-10}]
[{"$nulls":24},{"$f":"AA20","v":-10},{"$f":"AB20","v":-10}]
[{"$nulls":23},{"$f":"A21","v":"R14"},{"$f":"Y21","v":-10},{"$f":"Z21","v":-10}]
[{"$nulls":24},{"$f":"AA21","v":-10},{"$f":"AB21","v":-10}]
[{"$nulls":23},{"$f":"A22","v":"R15"},{"$f":"Y22","v":-10},{"$f":"Z22","v":-10}]
[{"$nulls":24},{"$f":"AA22","v":-10},{"$f":"AB22","v":-10}]
[{"$nulls":23},{"$f":"A23","v":"R16"},{"$f":"Y23","v":{"v":-10,"d":"-10.00"}},{"$f":"Z23","v":{"v":-10,"d":"-10.00"}}]
[{"$nulls":24},{"$f":"AA23","v":{"v":-10,"d":"-10.00"}},{"$f":"AB23","v":{"v":-10,"d":"-10.00"}}]
[{"$nulls":23},{"$f":"A24","v":"R17"},{"$f":"Y24","v":{"v":-10,"d":"-10.00"}},{"$f":"Z24","v":{"v":-10,"d":"-10.00"}}]
[{"$nulls":24},{"$f":"AA24","v":{"v":-10,"d":"-10.00"}},{"$f":"AB24","v":{"v":-10,"d":"-10.00"}}]
[{"$nulls":23},{"$f":"A25","v":"R18"},{"$f":"Y25","v":{"v":-10,"d":"-10.00"}},{"$f":"Z25","v":{"v":-10,"d":"-10.00"}}]
[{"$nulls":24},{"$f":"AA25","v":{"v":-10,"d":"-10.00"}},{"$f":"AB25","v":{"v":-10,"d":"-10.00"}}]
[{"$nulls":23},{"$f":"A26","v":"R19"},{"$f":"Y26","v":{"v":-10,"d":"-10.00"}},{"$f":"Z26","v":{"v":-10,"d":"-10.00"}}]
[{"$nulls":24},{"$f":"AA26","v":{"v":-10,"d":"-10.00"}},{"$f":"AB26","v":{"v":-10,"d":"-10.00"}}]
[{"$nulls":23},{"$f":"A27","v":"R20"},{"$f":"Y27","v":{"v":-10,"d":"-10.00"}},{"$f":"Z27","v":{"v":-10,"d":"-10.00"}}]
[{"$nulls":24},{"$f":"AA27","v":{"v":-10,"d":"-10.00"}},{"$f":"AB27","v":{"v":-10,"d":"-10.00"}}]

{"sheet":"Mål 4","index":11,"n_rows":72,"n_cols":30,"rows_kept":72,"merged":[[0,0,0,3],[0,4,0,6],[0,7,0,8],[0,11,0,13],[1,2,1,3],[1,5,1,6],[1,12,1,13],[2,0,2,2],[2,4,2,6],[2,7,2,8],[2,11,2,13],[3,0,4,3],[3,4,3,5],[3,7,4,10],[3,11,3,12],[5,24,5,25],[5,26,5,27],[30,0,30,2],[31,0,32,3],[34,2,34,3],[35,2,35,3]]}
["Risikoidentifikasjon og analyse",{"$nulls":3},"Ansvarlig:",{"$nulls":6},"Risikomatrise, \nse under"]
["Enhet:",null,{"$f":"IF(Forside!C2=\"\",\"\",Forside!C2)","v":"Tjenesteområde <<tjenesteområde>>"},null,"Dato:",{"$f":"IF(Forside!C4=\"\",\"\",Forside!C4)","v":""}]
["Mål / krav nr 4:",{"$nulls":3},"Risiko før tiltak",null,null,"Deltakere i prosessen:",{"$nulls":3},"Risiko etter tiltak"]
[{"$nulls":4},"Risiko-vurdering",null,"Risiko-nivå",{"$f":"IF(Forside!C3=\"\",\"\",Forside!C3)","v":"<<deltakere>>"},{"$nulls":3},"Risiko-vurdering",null,"Risiko-nivå"]
[{"$nulls":4},"S","K",{"$nulls":5},"S","K"]
[{"$nulls":3},"Gjsn risiko for målet:",{"$f":"IF(ISERROR(AVERAGE(E8:E27)),\"\",ROUND(AVERAGE(E8:E27),0))","v":""},{"$f":"IF(ISERROR(AVERAGE(F8:F27)),\"\",ROUND(AVERAGE(F8:F27),0))","v":""},{"$f":"IF(ISERROR(E6*F6),\"\",VLOOKUP(E6,Lists!B$10:G$14,CEILING(F6-0.5,1)+1,TRUE))","v":""},{"$nulls":4},{"$f":"IF(ISERROR(AVERAGE(L8:L27)),\"\",ROUND(AVERAGE(L8:L27),0))","v":""},{"$f":"IF(ISERROR(AVERAGE(M8:M27)),\"\",ROUND(AVERAGE(M8:M27),0))","v":""},{"$f":"IF(ISERROR(L6*M6),\"\",VLOOKUP(L6,Lists!B$10:G$14,CEILING(M6-0.5,1)+1,TRUE))","v":""},{"$nulls":10},"Før tiltak",null,"Etter tiltak"]
["Risiko nr","Mulige hendelser/ risiko","Område","Eksisterende tiltak","S","K","Risiko-nivå","Risikoeier:","Nye tiltak:","Ansvarlig:","Frist:","S","K","Risiko-nivå",{"$nulls":10},"X-forskyv konsekv","Y-forskyv Sanns","X-forskyv konsekv","Y-forskyv Sanns"]
["R1",{"$nulls":5},{"$f":"IF(F8*E8=0,\"\",VLOOKUP(E8,Lists!B$10:G$14,CEILING(F8-0.5,1)+1,TRUE))","v":""},{"$nulls":6},{"$f":"IF(M8*L8=0,\"\",VLOOKUP(L8,Lists!B$10:G$14,CEILING(M8-0.5,1)+1,TRUE))","v":""},{"$nulls":10},{"$f":"IF(F8=\"\",-10,F8+AC29)","v":{"v":-10,"d":"-10.00"}},{"$f":"IF(E8=\"\",-10,E8+AD29)","v":{"v":-10,"d":"-10.00"}},{"$f":"IF(M8=\"\",Y8,M8+AC29)","v":{"v":-10,"d":"-10.00"}},{"$f":"IF(L8=\"\",Z8,L8+AD29)","v":{"v":-10,"d":"-10.00"}}]
["R2",{"$nulls":5},{"$f":"IF(F9*E9=0,\"\",VLOOKUP(E9,Lists!B$10:G$14,CEILING(F9-0.5,1)+1,TRUE))","v":""},{"$nulls":6},{"$f":"IF(M9*L9=0,\"\",VLOOKUP(L9,Lists!B$10:G$14,CEILING(M9-0.5,1)+1,TRUE))","v":""},{"$nulls":10},{"v":-10,"d":"-10.00"},{"v":-10,"d":"-10.00"},{"v":-10,"d":"-10.00"},{"v":-10,"d":"-10.00"}]
["R3",{"$nulls":5},{"$f":"IF(F10*E10=0,\"\",VLOOKUP(E10,Lists!B$10:G$14,CEILING(F10-0.5,1)+1,TRUE))","v":""},{"$nulls":6},{"$f":"IF(M10*L10=0,\"\",VLOOKUP(L10,Lists!B$10:G$14,CEILING(M10-0.5,1)+1,TRUE))","v":""},{"$nulls":10},{"v":-10,"d":"-10.00"},{"v":-10,"d":"-10.00"},{"v":-10,"d":"-10.00"},{"v":-10,"d":"-10.00"}]
["R4",{"$nulls":5},{"$f":"IF(F11*E11=0,\"\",VLOOKUP(E11,Lists!B$10:G$14,CEILING(F11-0.5,1)+1,TRUE))","v":""},{"$nulls":6},{"$f":"IF(M11*L11=0,\"\",VLOOKUP(L11,Lists!B$10:G$14,CEILING(M11-0.5,1)+1,TRUE))","v":""},{"$nulls":10},{"v":-10,"d":"-10.00"},{"v":-10,"d":"-10.00"},{"v":-10,"d":"-10.00"},{"v":-10,"d":"-10.00"}]
["R5",{"$nulls":5},{"$f":"IF(F12*E12=0,\"\",VLOOKUP(E12,Lists!B$10:G$14,CEILING(F12-0.5,1)+1,TRUE))","v":""},{"$nulls":6},{"$f":"IF(M12*L12=0,\"\",VLOOKUP(L12,Lists!B$10:G$14,CEILING(M12-0.5,1)+1,TRUE))","v":""},{"$nulls":10},{"v":-10,"d":"-10.00"},{"v":-10,"d":"-10.00"},{"v":-10,"d":"-10.00"},{"v":-10,"d":"-10.00"}]
["R6",{"$nulls":5},{"$f":"IF(F13*E13=0,\"\",VLOOKUP(E13,Lists!B$10:G$14,CEILING(F13-0.5,1)+1,TRUE))","v":""},{"$nulls":6},{"$f":"IF(M13*L13=0,\"\",VLOOKUP(L13,Lists!B$10:G$14,CEILING(M13-0.5,1)+1,TRUE))","v":""},{"$nulls":10},{"v":-10,"d":"-10.00"},{"v":-10,"d":"-10.00"},{"v":-10,"d":"-10.00"},{"v":-10,"d":"-10.00"}]
["R7",{"$nulls":5},{"$f":"IF(F14*E14=0,\"\",VLOOKUP(E14,Lists!B$10:G$14,CEILING(F14-0.5,1)+1,TRUE))","v":""},{"$nulls":6},{"$f":"IF(M14*L14=0,\"\",VLOOKUP(L14,Lists!B$10:G$14,CEILING(M14-0.5,1)+1,TRUE))","v":""},{"$nulls":10},{"v":-10,"d":"-10.00"},{"v":-10,"d":"-10.00"},{"v":-10,"d":"-10.00"},{"v":-10,"d":"-10.00"}]
["R8",{"$nulls":5},{"$f":"IF(F15*E15=0,\"\",VLOOKUP(E15,Lists!B$10:G$14,CEILING(F15-0.5,1)+1,TRUE))","v":""},{"$nulls":6},{"$f":"IF(M15*L15=0,\"\",VLOOKUP(L15,Lists!B$10:G$14,CEILING(M15-0.5,1)+1,TRUE))","v":""},{"$nulls":10},{"v":-10,"d":"-10.00"},{"v":-10,"d":"-10.00"},{"v":-10,"d":"-10.00"},{"v":-10,"d":"-10.00"}]
["R9",{"$nulls":5},{"$f":"IF(F16*E16=0,\"\",VLOOKUP(E16,Lists!B$10:G$14,CEILING(F16-0.5,1)+1,TRUE))","v":""},{"$nulls":6},{"$f":"IF(M16*L16=0,\"\",VLOOKUP(L16,Lists!B$10:G$14,CEILING(M16-0.5,1)+1,TRUE))","v":""},{"$nulls":10},{"v":-10,"d":"-10.00"},{"v":-10,"d":"-10.00"},{"v":-10,"d":"-10.00"},{"v":-10,"d":"-10.00"}]
["R10",{"$nulls":5},{"$f":"IF(F17*E17=0,\"\",VLOOKUP(E17,Lists!B$10:G$14,CEILING(F17-0.5,1)+1,TRUE))","v":""},{"$nulls":6},{"$f":"IF(M17*L17=0,\"\",VLOOKUP(L17,Lists!B$10:G$14,CEILING(M17-0.5,1)+1,TRUE))","v":""},{"$nulls":10},{"v":-10,"d":"-10.00"},{"v":-10,"d":"-10.00"},{"v":-10,"d":"-10.00"},{"v":-10,"d":"-10.00"}]
["R11",{"$nulls":5},{"$f":"IF(F18*E18=0,\"\",VLOOKUP(E18,Lists!B$10:G$14,CEILING(F18-0.5,1)+1,TRUE))","v":""},{"$nulls":6},{"$f":"IF(M18*L18=0,\"\",VLOOKUP(L18,Lists!B$10:G$14,CEILING(M18-0.5,1)+1,TRUE))","v":""},{"$nulls":10},{"v":-10,"d":"-10.00"},{"v":-10,"d":"-10.00"},{"v":-10,"d":"-10.00"},{"v":-10,"d":"-10.00"}]
["R12",{"$nulls":5},{"$f":"IF(F19*E19=0,\"\",VLOOKUP(E19,Lists!B$10:G$14,CEILING(F19-0.5,1)+1,TRUE))","v":""},{"$nulls":6},{"$f":"IF(M19*L19=0,\"\",VLOOKUP(L19,Lists!B$10:G$14,CEILING(M19-0.5,1)+1,TRUE))","v":""},{"$nulls":10},{"v":-10,"d":"-10.00"},{"v":-10,"d":"-10.00"},{"v":-10,"d":"-10.00"},{"v":-10,"d":"-10.00"}]
["R13",{"$nulls":5},{"$f":"IF(F20*E20=0,\"\",VLOOKUP(E20,Lists!B$10:G$14,CEILING(F20-0.5,1)+1,TRUE))","v":""},{"$nulls":6},{"$f":"IF(M20*L20=0,\"\",VLOOKUP(L20,Lists!B$10:G$14,CEILING(M20-0.5,1)+1,TRUE))","v":""},{"$nulls":10},{"v":-10,"d":"-10.00"},{"v":-10,"d":"-10.00"},{"v":-10,"d":"-10.00"},{"v":-10,"d":"-10.00"}]
["R14",{"$nulls":5},{"$f":"IF(F21*E21=0,\"\",VLOOKUP(E21,Lists!B$10:G$14,CEILING(F21-0.5,1)+1,TRUE))","v":""},{"$nulls":6},{"$f":"IF(M21*L21=0,\"\",VLOOKUP(L21,Lists!B$10:G$14,CEILING(M21-0.5,1)+1,TRUE))","v":""},{"$nulls":10},{"v":-10,"d":"-10.00"},{"v":-10,"d":"-10.00"},{"v":-10,"d":"-10.00"},{"v":-10,"d":"-10.00"}]
["R15",{"$nulls":5},{"$f":"IF(F22*E22=0,\"\",VLOOKUP(E22,Lists!B$10:G$14,CEILING(F22-0.5,1)+1,TRUE))","v":""},{"$nulls":6},{"$f":"IF(M22*L22=0,\"\",VLOOKUP(L22,Lists!B$10:G$14,CEILING(M22-0.5,1)+1,TRUE))","v":""},{"$nulls":10},{"v":-10,"d":"-10.00"},{"v":-10,"d":"-10.00"},{"v":-10,"d":"-10.00"},{"v":-10,"d":"-10.00"}]
["R16",{"$nulls":5},{"$f":"IF(F23*E23=0,\"\",VLOOKUP(E23,Lists!B$10:G$14,CEILING(F23-0.5,1)+1,TRUE))","v":""},{"$nulls":6},{"$f":"IF(M23*L23=0,\"\",VLOOKUP(L23,Lists!B$10:G$14,CEILING(M23-0.5,1)+1,TRUE))","v":""},{"$nulls":10},{"v":-10,"d":"-10.00"},{"v":-10,"d":"-10.00"},{"v":-10,"d":"-10.00"},{"v":-10,"d":"-10.00"}]
["R17",{"$nulls":5},{"$f":"IF(F24*E24=0,\"\",VLOOKUP(E24,Lists!B$10:G$14,CEILING(F24-0.5,1)+1,TRUE))","v":""},{"$nulls":6},{"$f":"IF(M24*L24=0,\"\",VLOOKUP(L24,Lists!B$10:G$14,CEILING(M24-0.5,1)+1,TRUE))","v":""},{"$nulls":10},{"v":-10,"d":"-10.00"},{"v":-10,"d":"-10.00"},{"v":-10,"d":"-10.00"},{"v":-10,"d":"-10.00"}]
["R18",{"$nulls":5},{"$f":"IF(F25*E25=0,\"\",VLOOKUP(E25,Lists!B$10:G$14,CEILING(F25-0.5,1)+1,TRUE))","v":""},{"$nulls":6},{"$f":"IF(M25*L25=0,\"\",VLOOKUP(L25,Lists!B$10:G$14,CEILING(M25-0.5,1)+1,TRUE))","v":""},{"$nulls":10},{"v":-10,"d":"-10.00"},{"v":-10,"d":"-10.00"},{"v":-10,"d":"-10.00"},{"v":-10,"d":"-10.00"}]
["R19",{"$nulls":5},{"$f":"IF(F26*E26=0,\"\",VLOOKUP(E26,Lists!B$10:G$14,CEILING(F26-0.5,1)+1,TRUE))","v":""},{"$nulls":6},{"$f":"IF(M26*L26=0,\"\",VLOOKUP(L26,Lists!B$10:G$14,CEILING(M26-0.5,1)+1,TRUE))","v":""},{"$nulls":10},{"v":-10,"d":"-10.00"},{"v":-10,"d":"-10.00"},{"v":-10,"d":"-10.00"},{"v":-10,"d":"-10.00"}]
["R20",{"$nulls":5},{"$f":"IF(F27*E27=0,\"\",VLOOKUP(E27,Lists!B$10:G$14,CEILING(F27-0.5,1)+1,TRUE))","v":""},{"$nulls":6},{"$f":"IF(M27*L27=0,\"\",VLOOKUP(L27,Lists!B$10:G$14,CEILING(M27-0.5,1)+1,TRUE))","v":""},{"$nulls":10},{"v":-10,"d":"-10.00"},{"v":-10,"d":"-10.00"},{"v":-10,"d":"-10.00"},{"v":-10,"d":"-10.00"}]
[{"$nulls":28},"X-forskyv","Y-forskyv"]
[{"$nulls":28},-0.85,-0.5]
[{"$nulls":24},"X-Konsekvens","Y-Sannsynlighet",null,null,-0.85,-0.25]
[{"$f":"A3","v":"Mål / krav nr 4:"},{"$nulls":22},"Gj sn",{"$f":"IF(F6=\"\",-10,F6-0.5)","v":{"v":-10,"d":"-10.00"}},{"$f":"IF(E6=\"\",-10,E6-0.5)","v":{"v":-10,"d":"-10.00"}},null,null,-0.85,-0.75]
[{"$f":"IF(A4=\"\",\"\",A4)","v":""},{"$nulls":23},{"$f":"IF(M6=\"\",Y31,M6-0.6)","v":{"v":-10,"d":"-10.00"}},{"$f":"IF(L6=\"\",Z31,L6-0.6)","v":{"v":-10,"d":"-10.00"}},null,null,-0.75,-0.5]
[{"$nulls":23},{"$f":"A8","v":"R1"},{"$f":"Y8","v":{"v":-10,"d":"-10.00"}},{"$f":"Z8","v":-10},null,null,-0.75,-0.25]
[null,null,"Når risikovurdering før og etter tiltak er utfylt er:",{"$nulls":21},{"$f":"AA8","v":{"v":-10,"d":"-10.00"}},{"$f":"AB8","v":-10},null,null,-0.75,-0.75]
[null,null,"● = Risikonivå før tiltak",{"$nulls":20},{"$f":"A9","v":"R2"},{"$f":"Y9","v":-10},{"$f":"Z9","v":-10},null,null,-0.66,-0.5]
[null,null,"■ = Risikonivå etter tiltak",{"$nulls":21},{"$f":"AA9","v":{"v":-10,"d":"-10.00"}},{"$f":"AB9","v":-10},null,null,-0.66,-0.25]
[{"$nulls":23},{"$f":"A10","v":"R3"},{"$f":"Y10","v":-10},{"$f":"Z10","v":-10},null,null,-0.66,-0.75]
[{"$nulls":24},{"$f":"AA10","v":-10},{"$f":"AB10","v":-10},null,null,-0.5,-0.5]
[{"$nulls":23},{"$f":"A11","v":"R4"},{"$f":"Y11","v":-10},{"$f":"Z11","v":-10},null,null,-0.5,-0.25]
[{"$nulls":24},{"$f":"AA11","v":-10},{"$f":"AB11","v":-10},null,null,-0.5,-0.75]
[{"$nulls":23},{"$f":"A12","v":"R5"},{"$f":"Y12","v":-10},{"$f":"Z12","v":-10},null,null,-0.33,-0.5]
[{"$nulls":24},{"$f":"AA12","v":-10},{"$f":"AB12","v":-10},null,null,-0.33,-0.25]
[{"$nulls":23},{"$f":"A13","v":"R6"},{"$f":"Y13","v":-10},{"$f":"Z13","v":-10},null,null,-0.33,-0.75]
[{"$nulls":24},{"$f":"AA13","v":-10},{"$f":"AB13","v":-10},null,null,-0.25,-0.5]
[{"$nulls":23},{"$f":"A14","v":"R7"},{"$f":"Y14","v":-10},{"$f":"Z14","v":-10},null,null,-0.25,-0.25]
[{"$nulls":24},{"$f":"AA14","v":-10},{"$f":"AB14","v":-10},null,null,-0.25,-0.75]
[{"$nulls":23},{"$f":"A15","v":"R8"},{"$f":"Y15","v":-10},{"$f":"Z15","v":-10},null,null,-0.15,-0.5]
[{"$nulls":24},{"$f":"AA15","v":-10},{"$f":"AB15","v":-10},null,null,-0.15,-0.25]
[{"$nulls":23},{"$f":"A16","v":"R9"},{"$f":"Y16","v":-10},{"$f":"Z16","v":-10}]
[{"$nulls":24},{"$f":"AA16","v":-10},{"$f":"AB16","v":-10}]
[{"$nulls":23},{"$f":"A17","v":"R10"},{"$f":"Y17","v":-10},{"$f":"Z17","v":-10}]
[{"$nulls":24},{"$f":"AA17","v":-10},{"$f":"AB17","v":-10}]
[{"$nulls":23},{"$f":"A18","v":"R11"},{"$f":"Y18","v":-10},{"$f":"Z18","v":-10}]
[{"$nulls":24},{"$f":"AA18","v":-10},{"$f":"AB18","v":-10}]
[{"$nulls":23},{"$f":"A19","v":"R12"},{"$f":"Y19","v":{"v":-10,"d":"-10.00"}},{"$f":"Z19","v":-10}]
[{"$nulls":24},{"$f":"AA19","v":-10},{"$f":"AB19","v":-10}]
[{"$nulls":23},{"$f":"A20","v":"R13"},{"$f":"Y20","v":-10},{"$f":"Z20","v":-10}]
[{"$nulls":24},{"$f":"AA20","v":-10},{"$f":"AB20","v":-10}]
[{"$nulls":23},{"$f":"A21","v":"R14"},{"$f":"Y21","v":-10},{"$f":"Z21","v":-10}]
[{"$nulls":24},{"$f":"AA21","v":-10},{"$f":"AB21","v":-10}]
[{"$nulls":23},{"$f":"A22","v":"R15"},{"$f":"Y22","v":-10},{"$f":"Z22","v":-10}]
[{"$nulls":24},{"$f":"AA22","v":-10},{"$f":"AB22","v":-10}]
[{"$nulls":23},{"$f":"A23","v":"R16"},{"$f":"Y23","v":{"v":-10,"d":"-10.00"}},{"$f":"Z23","v":{"v":-10,"d":"-10.00"}}]
[{"$nulls":24},{"$f":"AA23","v":{"v":-10,"d":"-10.00"}},{"$f":"AB23","v":{"v":-10,"d":"-10.00"}}]
[{"$nulls":23},{"$f":"A24","v":"R17"},{"$f":"Y24","v":{"v":-10,"d":"-10.00"}},{"$f":"Z24","v":{"v":-10,"d":"-10.00"}}]
[{"$nulls":24},{"$f":"AA24","v":{"v":-10,"d":"-10.00"}},{"$f":"AB24","v":{"v":-10,"d":"-10.00"}}]
[{"$nulls":23},{"$f":"A25","v":"R18"},{"$f":"Y25","v":{"v":-10,"d":"-10.00"}},{"$f":"Z25","v":{"v":-10,"d":"-10.00"}}]
[{"$nulls":24},{"$f":"AA25","v":{"v":-10,"d":"-10.00"}},{"$f":"AB25","v":{"v":-10,"d":"-10.00"}}]
[{"$nulls":23},{"$f":"A26","v":"R19"},{"$f":"Y26","v":{"v":-10,"d":"-10.00"}},{"$f":"Z26","v":{"v":-10,"d":"-10.00"}}]
[{"$nulls":24},{"$f":"AA26","v":{"v":-10,"d":"-10.00"}},{"$f":"AB26","v":{"v":-10,"d":"-10.00"}}]
[{"$nulls":23},{"$f":"A27","v":"R20"},{"$f":"Y27","v":{"v":-10,"d":"-10.00"}},{"$f":"Z27","v":{"v":-10,"d":"-10.00"}}]
[{"$nulls":24},{"$f":"AA27","v":{"v":-10,"d":"-10.00"}},{"$f":"AB27","v":{"v":-10,"d":"-10.00"}}]

{"sheet":"Mål 5","index":12,"n_rows":72,"n_cols":30,"rows_kept":72,"merged":[[0,0,0,3],[0,4,0,6],[0,7,0,8],[0,11,0,13],[1,2,1,3],[1,5,1,6],[1,12,1,13],[2,0,2,2],[2,4,2,6],[2,7,2,8],[2,11,2,13],[3,0,4,3],[3,4,3,5],[3,7,4,10],[3,11,3,12],[5,24,5,25],[5,26,5,27],[30,0,30,2],[31,0,32,3],[34,2,34,3],[35,2,35,3]]}
["Risikoidentifikasjon og analyse",{"$nulls":3},"Ansvarlig:",{"$nulls":6},"Risikomatrise, \nse under"]
["Enhet:",null,{"$f":"IF(Forside!C2=\"\",\"\",Forside!C2)","v":"Tjenesteområde <<tjenesteområde>>"},null,"Dato:",{"$f":"IF(Forside!C4=\"\",\"\",Forside!C4)","v":""}]
["Mål / resultatkrav nr 5:",{"$nulls":3},"Risiko før tiltak",null,null,"Deltakere i prosessen:",{"$nulls":3},"Risiko etter tiltak"]
[{"$nulls":4},"Risiko-vurdering",null,"Risiko-nivå",{"$f":"IF(Forside!C3=\"\",\"\",Forside!C3)","v":"<<deltakere>>"},{"$nulls":3},"Risiko-vurdering",null,"Risiko-nivå"]
[{"$nulls":4},"S","K",{"$nulls":5},"S","K"]
[{"$nulls":3},"Gjsn risiko for målet:",{"$f":"IF(ISERROR(AVERAGE(E8:E27)),\"\",ROUND(AVERAGE(E8:E27),0))","v":""},{"$f":"IF(ISERROR(AVERAGE(F8:F27)),\"\",ROUND(AVERAGE(F8:F27),0))","v":""},{"$f":"IF(ISERROR(E6*F6),\"\",VLOOKUP(E6,Lists!B$10:G$14,CEILING(F6-0.5,1)+1,TRUE))","v":""},{"$nulls":4},{"$f":"IF(ISERROR(AVERAGE(L8:L27)),\"\",ROUND(AVERAGE(L8:L27),0))","v":""},{"$f":"IF(ISERROR(AVERAGE(M8:M27)),\"\",ROUND(AVERAGE(M8:M27),0))","v":""},{"$f":"IF(ISERROR(L6*M6),\"\",VLOOKUP(L6,Lists!B$10:G$14,CEILING(M6-0.5,1)+1,TRUE))","v":""},{"$nulls":10},"Før tiltak",null,"Etter tiltak"]
["Risiko nr","Mulige hendelser/ risiko","Område","Eksisterende tiltak","S","K","Risiko-nivå","Risikoeier:","Nye tiltak:","Ansvarlig:","Frist:","S","K","Risiko-nivå",{"$nulls":10},"X-forskyv konsekv","Y-forskyv Sanns","X-forskyv konsekv","Y-forskyv Sanns"]
["R1",{"$nulls":5},{"$f":"IF(F8*E8=0,\"\",VLOOKUP(E8,Lists!B$10:G$14,CEILING(F8-0.5,1)+1,TRUE))","v":""},{"$nulls":6},{"$f":"IF(M8*L8=0,\"\",VLOOKUP(L8,Lists!B$10:G$14,CEILING(M8-0.5,1)+1,TRUE))","v":""},{"$nulls":10},{"$f":"IF(F8=\"\",-10,F8+AC29)","v":{"v":-10,"d":"-10.00"}},{"$f":"IF(E8=\"\",-10,E8+AD29)","v":{"v":-10,"d":"-10.00"}},{"$f":"IF(M8=\"\",Y8,M8+AC29)","v":{"v":-10,"d":"-10.00"}},{"$f":"IF(L8=\"\",Z8,L8+AD29)","v":{"v":-10,"d":"-10.00"}}]
["R2",{"$nulls":5},{"$f":"IF(F9*E9=0,\"\",VLOOKUP(E9,Lists!B$10:G$14,CEILING(F9-0.5,1)+1,TRUE))","v":""},{"$nulls":6},{"$f":"IF(M9*L9=0,\"\",VLOOKUP(L9,Lists!B$10:G$14,CEILING(M9-0.5,1)+1,TRUE))","v":""},{"$nulls":10},{"v":-10,"d":"-10.00"},{"v":-10,"d":"-10.00"},{"v":-10,"d":"-10.00"},{"v":-10,"d":"-10.00"}]
["R3",{"$nulls":5},{"$f":"IF(F10*E10=0,\"\",VLOOKUP(E10,Lists!B$10:G$14,CEILING(F10-0.5,1)+1,TRUE))","v":""},{"$nulls":6},{"$f":"IF(M10*L10=0,\"\",VLOOKUP(L10,Lists!B$10:G$14,CEILING(M10-0.5,1)+1,TRUE))","v":""},{"$nulls":10},{"v":-10,"d":"-10.00"},{"v":-10,"d":"-10.00"},{"v":-10,"d":"-10.00"},{"v":-10,"d":"-10.00"}]
["R4",{"$nulls":5},{"$f":"IF(F11*E11=0,\"\",VLOOKUP(E11,Lists!B$10:G$14,CEILING(F11-0.5,1)+1,TRUE))","v":""},{"$nulls":6},{"$f":"IF(M11*L11=0,\"\",VLOOKUP(L11,Lists!B$10:G$14,CEILING(M11-0.5,1)+1,TRUE))","v":""},{"$nulls":10},{"v":-10,"d":"-10.00"},{"v":-10,"d":"-10.00"},{"v":-10,"d":"-10.00"},{"v":-10,"d":"-10.00"}]
["R5",{"$nulls":5},{"$f":"IF(F12*E12=0,\"\",VLOOKUP(E12,Lists!B$10:G$14,CEILING(F12-0.5,1)+1,TRUE))","v":""},{"$nulls":6},{"$f":"IF(M12*L12=0,\"\",VLOOKUP(L12,Lists!B$10:G$14,CEILING(M12-0.5,1)+1,TRUE))","v":""},{"$nulls":10},{"v":-10,"d":"-10.00"},{"v":-10,"d":"-10.00"},{"v":-10,"d":"-10.00"},{"v":-10,"d":"-10.00"}]
["R6",{"$nulls":5},{"$f":"IF(F13*E13=0,\"\",VLOOKUP(E13,Lists!B$10:G$14,CEILING(F13-0.5,1)+1,TRUE))","v":""},{"$nulls":6},{"$f":"IF(M13*L13=0,\"\",VLOOKUP(L13,Lists!B$10:G$14,CEILING(M13-0.5,1)+1,TRUE))","v":""},{"$nulls":10},{"v":-10,"d":"-10.00"},{"v":-10,"d":"-10.00"},{"v":-10,"d":"-10.00"},{"v":-10,"d":"-10.00"}]
["R7",{"$nulls":5},{"$f":"IF(F14*E14=0,\"\",VLOOKUP(E14,Lists!B$10:G$14,CEILING(F14-0.5,1)+1,TRUE))","v":""},{"$nulls":6},{"$f":"IF(M14*L14=0,\"\",VLOOKUP(L14,Lists!B$10:G$14,CEILING(M14-0.5,1)+1,TRUE))","v":""},{"$nulls":10},{"v":-10,"d":"-10.00"},{"v":-10,"d":"-10.00"},{"v":-10,"d":"-10.00"},{"v":-10,"d":"-10.00"}]
["R8",{"$nulls":5},{"$f":"IF(F15*E15=0,\"\",VLOOKUP(E15,Lists!B$10:G$14,CEILING(F15-0.5,1)+1,TRUE))","v":""},{"$nulls":6},{"$f":"IF(M15*L15=0,\"\",VLOOKUP(L15,Lists!B$10:G$14,CEILING(M15-0.5,1)+1,TRUE))","v":""},{"$nulls":10},{"v":-10,"d":"-10.00"},{"v":-10,"d":"-10.00"},{"v":-10,"d":"-10.00"},{"v":-10,"d":"-10.00"}]
["R9",{"$nulls":5},{"$f":"IF(F16*E16=0,\"\",VLOOKUP(E16,Lists!B$10:G$14,CEILING(F16-0.5,1)+1,TRUE))","v":""},{"$nulls":6},{"$f":"IF(M16*L16=0,\"\",VLOOKUP(L16,Lists!B$10:G$14,CEILING(M16-0.5,1)+1,TRUE))","v":""},{"$nulls":10},{"v":-10,"d":"-10.00"},{"v":-10,"d":"-10.00"},{"v":-10,"d":"-10.00"},{"v":-10,"d":"-10.00"}]
["R10",{"$nulls":5},{"$f":"IF(F17*E17=0,\"\",VLOOKUP(E17,Lists!B$10:G$14,CEILING(F17-0.5,1)+1,TRUE))","v":""},{"$nulls":6},{"$f":"IF(M17*L17=0,\"\",VLOOKUP(L17,Lists!B$10:G$14,CEILING(M17-0.5,1)+1,TRUE))","v":""},{"$nulls":10},{"v":-10,"d":"-10.00"},{"v":-10,"d":"-10.00"},{"v":-10,"d":"-10.00"},{"v":-10,"d":"-10.00"}]
["R11",{"$nulls":5},{"$f":"IF(F18*E18=0,\"\",VLOOKUP(E18,Lists!B$10:G$14,CEILING(F18-0.5,1)+1,TRUE))","v":""},{"$nulls":6},{"$f":"IF(M18*L18=0,\"\",VLOOKUP(L18,Lists!B$10:G$14,CEILING(M18-0.5,1)+1,TRUE))","v":""},{"$nulls":10},{"v":-10,"d":"-10.00"},{"v":-10,"d":"-10.00"},{"v":-10,"d":"-10.00"},{"v":-10,"d":"-10.00"}]
["R12",{"$nulls":5},{"$f":"IF(F19*E19=0,\"\",VLOOKUP(E19,Lists!B$10:G$14,CEILING(F19-0.5,1)+1,TRUE))","v":""},{"$nulls":6},{"$f":"IF(M19*L19=0,\"\",VLOOKUP(L19,Lists!B$10:G$14,CEILING(M19-0.5,1)+1,TRUE))","v":""},{"$nulls":10},{"v":-10,"d":"-10.00"},{"v":-10,"d":"-10.00"},{"v":-10,"d":"-10.00"},{"v":-10,"d":"-10.00"}]
["R13",{"$nulls":5},{"$f":"IF(F20*E20=0,\"\",VLOOKUP(E20,Lists!B$10:G$14,CEILING(F20-0.5,1)+1,TRUE))","v":""},{"$nulls":6},{"$f":"IF(M20*L20=0,\"\",VLOOKUP(L20,Lists!B$10:G$14,CEILING(M20-0.5,1)+1,TRUE))","v":""},{"$nulls":10},{"v":-10,"d":"-10.00"},{"v":-10,"d":"-10.00"},{"v":-10,"d":"-10.00"},{"v":-10,"d":"-10.00"}]
["R14",{"$nulls":5},{"$f":"IF(F21*E21=0,\"\",VLOOKUP(E21,Lists!B$10:G$14,CEILING(F21-0.5,1)+1,TRUE))","v":""},{"$nulls":6},{"$f":"IF(M21*L21=0,\"\",VLOOKUP(L21,Lists!B$10:G$14,CEILING(M21-0.5,1)+1,TRUE))","v":""},{"$nulls":10},{"v":-10,"d":"-10.00"},{"v":-10,"d":"-10.00"},{"v":-10,"d":"-10.00"},{"v":-10,"d":"-10.00"}]
["R15",{"$nulls":5},{"$f":"IF(F22*E22=0,\"\",VLOOKUP(E22,Lists!B$10:G$14,CEILING(F22-0.5,1)+1,TRUE))","v":""},{"$nulls":6},{"$f":"IF(M22*L22=0,\"\",VLOOKUP(L22,Lists!B$10:G$14,CEILING(M22-0.5,1)+1,TRUE))","v":""},{"$nulls":10},{"v":-10,"d":"-10.00"},{"v":-10,"d":"-10.00"},{"v":-10,"d":"-10.00"},{"v":-10,"d":"-10.00"}]
["R16",{"$nulls":5},{"$f":"IF(F23*E23=0,\"\",VLOOKUP(E23,Lists!B$10:G$14,CEILING(F23-0.5,1)+1,TRUE))","v":""},{"$nulls":6},{"$f":"IF(M23*L23=0,\"\",VLOOKUP(L23,Lists!B$10:G$14,CEILING(M23-0.5,1)+1,TRUE))","v":""},{"$nulls":10},{"v":-10,"d":"-10.00"},{"v":-10,"d":"-10.00"},{"v":-10,"d":"-10.00"},{"v":-10,"d":"-10.00"}]
["R17",{"$nulls":5},{"$f":"IF(F24*E24=0,\"\",VLOOKUP(E24,Lists!B$10:G$14,CEILING(F24-0.5,1)+1,TRUE))","v":""},{"$nulls":6},{"$f":"IF(M24*L24=0,\"\",VLOOKUP(L24,Lists!B$10:G$14,CEILING(M24-0.5,1)+1,TRUE))","v":""},{"$nulls":10},{"v":-10,"d":"-10.00"},{"v":-10,"d":"-10.00"},{"v":-10,"d":"-10.00"},{"v":-10,"d":"-10.00"}]
["R18",{"$nulls":5},{"$f":"IF(F25*E25=0,\"\",VLOOKUP(E25,Lists!B$10:G$14,CEILING(F25-0.5,1)+1,TRUE))","v":""},{"$nulls":6},{"$f":"IF(M25*L25=0,\"\",VLOOKUP(L25,Lists!B$10:G$14,CEILING(M25-0.5,1)+1,TRUE))","v":""},{"$nulls":10},{"v":-10,"d":"-10.00"},{"v":-10,"d":"-10.00"},{"v":-10,"d":"-10.00"},{"v":-10,"d":"-10.00"}]
["R19",{"$nulls":5},{"$f":"IF(F26*E26=0,\"\",VLOOKUP(E26,Lists!B$10:G$14,CEILING(F26-0.5,1)+1,TRUE))","v":""},{"$nulls":6},{"$f":"IF(M26*L26=0,\"\",VLOOKUP(L26,Lists!B$10:G$14,CEILING(M26-0.5,1)+1,TRUE))","v":""},{"$nulls":10},{"v":-10,"d":"-10.00"},{"v":-10,"d":"-10.00"},{"v":-10,"d":"-10.00"},{"v":-10,"d":"-10.00"}]
["R20",{"$nulls":5},{"$f":"IF(F27*E27=0,\"\",VLOOKUP(E27,Lists!B$10:G$14,CEILING(F27-0.5,1)+1,TRUE))","v":""},{"$nulls":6},{"$f":"IF(M27*L27=0,\"\",VLOOKUP(L27,Lists!B$10:G$14,CEILING(M27-0.5,1)+1,TRUE))","v":""},{"$nulls":10},{"v":-10,"d":"-10.00"},{"v":-10,"d":"-10.00"},{"v":-10,"d":"-10.00"},{"v":-10,"d":"-10.00"}]
[{"$nulls":28},"X-forskyv","Y-forskyv"]
[{"$nulls":28},-0.85,-0.5]
[{"$nulls":24},"X-Konsekvens","Y-Sannsynlighet",null,null,-0.85,-0.25]
[{"$f":"A3","v":"Mål / resultatkrav nr 5:"},{"$nulls":22},"Gj sn",{"$f":"IF(F6=\"\",-10,F6-0.5)","v":{"v":-10,"d":"-10.00"}},{"$f":"IF(E6=\"\",-10,E6-0.5)","v":{"v":-10,"d":"-10.00"}},null,null,-0.85,-0.75]
[{"$f":"IF(A4=\"\",\"\",A4)","v":""},{"$nulls":23},{"$f":"IF(M6=\"\",Y31,M6-0.6)","v":{"v":-10,"d":"-10.00"}},{"$f":"IF(L6=\"\",Z31,L6-0.6)","v":{"v":-10,"d":"-10.00"}},null,null,-0.75,-0.5]
[{"$nulls":23},{"$f":"A8","v":"R1"},{"$f":"Y8","v":{"v":-10,"d":"-10.00"}},{"$f":"Z8","v":-10},null,null,-0.75,-0.25]
[null,null,"Når risikovurdering før og etter tiltak er utfylt er:",{"$nulls":21},{"$f":"AA8","v":{"v":-10,"d":"-10.00"}},{"$f":"AB8","v":-10},null,null,-0.75,-0.75]
[null,null,"● = Risikonivå før tiltak",{"$nulls":20},{"$f":"A9","v":"R2"},{"$f":"Y9","v":-10},{"$f":"Z9","v":-10},null,null,-0.66,-0.5]
[null,null,"■ = Risikonivå etter tiltak",{"$nulls":21},{"$f":"AA9","v":{"v":-10,"d":"-10.00"}},{"$f":"AB9","v":-10},null,null,-0.66,-0.25]
[{"$nulls":23},{"$f":"A10","v":"R3"},{"$f":"Y10","v":-10},{"$f":"Z10","v":-10},null,null,-0.66,-0.75]
[{"$nulls":24},{"$f":"AA10","v":-10},{"$f":"AB10","v":-10},null,null,-0.5,-0.5]
[{"$nulls":23},{"$f":"A11","v":"R4"},{"$f":"Y11","v":-10},{"$f":"Z11","v":-10},null,null,-0.5,-0.25]
[{"$nulls":24},{"$f":"AA11","v":-10},{"$f":"AB11","v":-10},null,null,-0.5,-0.75]
[{"$nulls":23},{"$f":"A12","v":"R5"},{"$f":"Y12","v":-10},{"$f":"Z12","v":-10},null,null,-0.33,-0.5]
[{"$nulls":24},{"$f":"AA12","v":-10},{"$f":"AB12","v":-10},null,null,-0.33,-0.25]
[{"$nulls":23},{"$f":"A13","v":"R6"},{"$f":"Y13","v":-10},{"$f":"Z13","v":-10},null,null,-0.33,-0.75]
[{"$nulls":24},{"$f":"AA13","v":-10},{"$f":"AB13","v":-10},null,null,-0.25,-0.5]
[{"$nulls":23},{"$f":"A14","v":"R7"},{"$f":"Y14","v":-10},{"$f":"Z14","v":-10},null,null,-0.25,-0.25]
[{"$nulls":24},{"$f":"AA14","v":-10},{"$f":"AB14","v":-10},null,null,-0.25,-0.75]
[{"$nulls":23},{"$f":"A15","v":"R8"},{"$f":"Y15","v":-10},{"$f":"Z15","v":-10},null,null,-0.15,-0.5]
[{"$nulls":24},{"$f":"AA15","v":-10},{"$f":"AB15","v":-10},null,null,-0.15,-0.25]
[{"$nulls":23},{"$f":"A16","v":"R9"},{"$f":"Y16","v":-10},{"$f":"Z16","v":-10}]
[{"$nulls":24},{"$f":"AA16","v":-10},{"$f":"AB16","v":-10}]
[{"$nulls":23},{"$f":"A17","v":"R10"},{"$f":"Y17","v":-10},{"$f":"Z17","v":-10}]
[{"$nulls":24},{"$f":"AA17","v":-10},{"$f":"AB17","v":-10}]
[{"$nulls":23},{"$f":"A18","v":"R11"},{"$f":"Y18","v":-10},{"$f":"Z18","v":-10}]
[{"$nulls":24},{"$f":"AA18","v":-10},{"$f":"AB18","v":-10}]
[{"$nulls":23},{"$f":"A19","v":"R12"},{"$f":"Y19","v":{"v":-10,"d":"-10.00"}},{"$f":"Z19","v":-10}]
[{"$nulls":24},{"$f":"AA19","v":-10},{"$f":"AB19","v":-10}]
[{"$nulls":23},{"$f":"A20","v":"R13"},{"$f":"Y20","v":-10},{"$f":"Z20","v":-10}]
[{"$nulls":24},{"$f":"AA20","v":-10},{"$f":"AB20","v":-10}]
[{"$nulls":23},{"$f":"A21","v":"R14"},{"$f":"Y21","v":-10},{"$f":"Z21","v":-10}]
[{"$nulls":24},{"$f":"AA21","v":-10},{"$f":"AB21","v":-10}]
[{"$nulls":23},{"$f":"A22","v":"R15"},{"$f":"Y22","v":-10},{"$f":"Z22","v":-10}]
[{"$nulls":24},{"$f":"AA22","v":-10},{"$f":"AB22","v":-10}]
[{"$nulls":23},{"$f":"A23","v":"R16"},{"$f":"Y23","v":{"v":-10,"d":"-10.00"}},{"$f":"Z23","v":{"v":-10,"d":"-10.00"}}]
[{"$nulls":24},{"$f":"AA23","v":{"v":-10,"d":"-10.00"}},{"$f":"AB23","v":{"v":-10,"d":"-10.00"}}]
[{"$nulls":23},{"$f":"A24","v":"R17"},{"$f":"Y24","v":{"v":-10,"d":"-10.00"}},{"$f":"Z24","v":{"v":-10,"d":"-10.00"}}]
[{"$nulls":24},{"$f":"AA24","v":{"v":-10,"d":"-10.00"}},{"$f":"AB24","v":{"v":-10,"d":"-10.00"}}]
[{"$nulls":23},{"$f":"A25","v":"R18"},{"$f":"Y25","v":{"v":-10,"d":"-10.00"}},{"$f":"Z25","v":{"v":-10,"d":"-10.00"}}]
[{"$nulls":24},{"$f":"AA25","v":{"v":-10,"d":"-10.00"}},{"$f":"AB25","v":{"v":-10,"d":"-10.00"}}]
[{"$nulls":23},{"$f":"A26","v":"R19"},{"$f":"Y26","v":{"v":-10,"d":"-10.00"}},{"$f":"Z26","v":{"v":-10,"d":"-10.00"}}]
[{"$nulls":24},{"$f":"AA26","v":{"v":-10,"d":"-10.00"}},{"$f":"AB26","v":{"v":-10,"d":"-10.00"}}]
[{"$nulls":23},{"$f":"A27","v":"R20"},{"$f":"Y27","v":{"v":-10,"d":"-10.00"}},{"$f":"Z27","v":{"v":-10,"d":"-10.00"}}]
[{"$nulls":24},{"$f":"AA27","v":{"v":-10,"d":"-10.00"}},{"$f":"AB27","v":{"v":-10,"d":"-10.00"}}]

{"sheet":"Mål 6","index":13,"n_rows":72,"n_cols":30,"rows_kept":72,"merged":[[0,0,0,3],[0,4,0,6],[0,7,0,8],[0,11,0,13],[1,2,1,3],[1,5,1,6],[1,12,1,13],[2,0,2,2],[2,4,2,6],[2,7,2,8],[2,11,2,13],[3,0,4,3],[3,4,3,5],[3,7,4,10],[3,11,3,12],[5,24,5,25],[5,26,5,27],[30,0,30,2],[31,0,32,3],[34,2,34,3],[35,2,35,3]]}
["Risikoidentifikasjon og analyse",{"$nulls":3},"Ansvarlig:",{"$nulls":6},"Risikomatrise, \nse under"]
["Enhet:",null,{"$f":"IF(Forside!C2=\"\",\"\",Forside!C2)","v":"Tjenesteområde <<tjenesteområde>>"},null,"Dato:",{"$f":"IF(Forside!C4=\"\",\"\",Forside!C4)","v":""}]
["Mål / krav nr 6:",{"$nulls":3},"Risiko før tiltak",null,null,"Deltakere i prosessen:",{"$nulls":3},"Risiko etter tiltak"]
[{"$nulls":4},"Risiko-vurdering",null,"Risiko-nivå",{"$f":"IF(Forside!C3=\"\",\"\",Forside!C3)","v":"<<deltakere>>"},{"$nulls":3},"Risiko-vurdering",null,"Risiko-nivå"]
[{"$nulls":4},"S","K",{"$nulls":5},"S","K"]
[{"$nulls":3},"Gjsn risiko for målet:",{"$f":"IF(ISERROR(AVERAGE(E8:E27)),\"\",ROUND(AVERAGE(E8:E27),0))","v":""},{"$f":"IF(ISERROR(AVERAGE(F8:F27)),\"\",ROUND(AVERAGE(F8:F27),0))","v":""},{"$f":"IF(ISERROR(E6*F6),\"\",VLOOKUP(E6,Lists!B$10:G$14,CEILING(F6-0.5,1)+1,TRUE))","v":""},{"$nulls":4},{"$f":"IF(ISERROR(AVERAGE(L8:L27)),\"\",ROUND(AVERAGE(L8:L27),0))","v":""},{"$f":"IF(ISERROR(AVERAGE(M8:M27)),\"\",ROUND(AVERAGE(M8:M27),0))","v":""},{"$f":"IF(ISERROR(L6*M6),\"\",VLOOKUP(L6,Lists!B$10:G$14,CEILING(M6-0.5,1)+1,TRUE))","v":""},{"$nulls":10},"Før tiltak",null,"Etter tiltak"]
["Risiko nr","Mulige hendelser/ risiko","Område","Eksisterende tiltak","S","K","Risiko-nivå","Risikoeier:","Nye tiltak:","Ansvarlig:","Frist:","S","K","Risiko-nivå",{"$nulls":10},"X-forskyv konsekv","Y-forskyv Sanns","X-forskyv konsekv","Y-forskyv Sanns"]
["R1",{"$nulls":5},{"$f":"IF(F8*E8=0,\"\",VLOOKUP(E8,Lists!B$10:G$14,CEILING(F8-0.5,1)+1,TRUE))","v":""},{"$nulls":6},{"$f":"IF(M8*L8=0,\"\",VLOOKUP(L8,Lists!B$10:G$14,CEILING(M8-0.5,1)+1,TRUE))","v":""},{"$nulls":10},{"$f":"IF(F8=\"\",-10,F8+AC29)","v":{"v":-10,"d":"-10.00"}},{"$f":"IF(E8=\"\",-10,E8+AD29)","v":{"v":-10,"d":"-10.00"}},{"$f":"IF(M8=\"\",Y8,M8+AC29)","v":{"v":-10,"d":"-10.00"}},{"$f":"IF(L8=\"\",Z8,L8+AD29)","v":{"v":-10,"d":"-10.00"}}]
["R2",{"$nulls":5},{"$f":"IF(F9*E9=0,\"\",VLOOKUP(E9,Lists!B$10:G$14,CEILING(F9-0.5,1)+1,TRUE))","v":""},{"$nulls":6},{"$f":"IF(M9*L9=0,\"\",VLOOKUP(L9,Lists!B$10:G$14,CEILING(M9-0.5,1)+1,TRUE))","v":""},{"$nulls":10},{"v":-10,"d":"-10.00"},{"v":-10,"d":"-10.00"},{"v":-10,"d":"-10.00"},{"v":-10,"d":"-10.00"}]
["R3",{"$nulls":5},{"$f":"IF(F10*E10=0,\"\",VLOOKUP(E10,Lists!B$10:G$14,CEILING(F10-0.5,1)+1,TRUE))","v":""},{"$nulls":6},{"$f":"IF(M10*L10=0,\"\",VLOOKUP(L10,Lists!B$10:G$14,CEILING(M10-0.5,1)+1,TRUE))","v":""},{"$nulls":10},{"v":-10,"d":"-10.00"},{"v":-10,"d":"-10.00"},{"v":-10,"d":"-10.00"},{"v":-10,"d":"-10.00"}]
["R4",{"$nulls":5},{"$f":"IF(F11*E11=0,\"\",VLOOKUP(E11,Lists!B$10:G$14,CEILING(F11-0.5,1)+1,TRUE))","v":""},{"$nulls":6},{"$f":"IF(M11*L11=0,\"\",VLOOKUP(L11,Lists!B$10:G$14,CEILING(M11-0.5,1)+1,TRUE))","v":""},{"$nulls":10},{"v":-10,"d":"-10.00"},{"v":-10,"d":"-10.00"},{"v":-10,"d":"-10.00"},{"v":-10,"d":"-10.00"}]
["R5",{"$nulls":5},{"$f":"IF(F12*E12=0,\"\",VLOOKUP(E12,Lists!B$10:G$14,CEILING(F12-0.5,1)+1,TRUE))","v":""},{"$nulls":6},{"$f":"IF(M12*L12=0,\"\",VLOOKUP(L12,Lists!B$10:G$14,CEILING(M12-0.5,1)+1,TRUE))","v":""},{"$nulls":10},{"v":-10,"d":"-10.00"},{"v":-10,"d":"-10.00"},{"v":-10,"d":"-10.00"},{"v":-10,"d":"-10.00"}]
["R6",{"$nulls":5},{"$f":"IF(F13*E13=0,\"\",VLOOKUP(E13,Lists!B$10:G$14,CEILING(F13-0.5,1)+1,TRUE))","v":""},{"$nulls":6},{"$f":"IF(M13*L13=0,\"\",VLOOKUP(L13,Lists!B$10:G$14,CEILING(M13-0.5,1)+1,TRUE))","v":""},{"$nulls":10},{"v":-10,"d":"-10.00"},{"v":-10,"d":"-10.00"},{"v":-10,"d":"-10.00"},{"v":-10,"d":"-10.00"}]
["R7",{"$nulls":5},{"$f":"IF(F14*E14=0,\"\",VLOOKUP(E14,Lists!B$10:G$14,CEILING(F14-0.5,1)+1,TRUE))","v":""},{"$nulls":6},{"$f":"IF(M14*L14=0,\"\",VLOOKUP(L14,Lists!B$10:G$14,CEILING(M14-0.5,1)+1,TRUE))","v":""},{"$nulls":10},{"v":-10,"d":"-10.00"},{"v":-10,"d":"-10.00"},{"v":-10,"d":"-10.00"},{"v":-10,"d":"-10.00"}]
["R8",{"$nulls":5},{"$f":"IF(F15*E15=0,\"\",VLOOKUP(E15,Lists!B$10:G$14,CEILING(F15-0.5,1)+1,TRUE))","v":""},{"$nulls":6},{"$f":"IF(M15*L15=0,\"\",VLOOKUP(L15,Lists!B$10:G$14,CEILING(M15-0.5,1)+1,TRUE))","v":""},{"$nulls":10},{"v":-10,"d":"-10.00"},{"v":-10,"d":"-10.00"},{"v":-10,"d":"-10.00"},{"v":-10,"d":"-10.00"}]
["R9",{"$nulls":5},{"$f":"IF(F16*E16=0,\"\",VLOOKUP(E16,Lists!B$10:G$14,CEILING(F16-0.5,1)+1,TRUE))","v":""},{"$nulls":6},{"$f":"IF(M16*L16=0,\"\",VLOOKUP(L16,Lists!B$10:G$14,CEILING(M16-0.5,1)+1,TRUE))","v":""},{"$nulls":10},{"v":-10,"d":"-10.00"},{"v":-10,"d":"-10.00"},{"v":-10,"d":"-10.00"},{"v":-10,"d":"-10.00"}]
["R10",{"$nulls":5},{"$f":"IF(F17*E17=0,\"\",VLOOKUP(E17,Lists!B$10:G$14,CEILING(F17-0.5,1)+1,TRUE))","v":""},{"$nulls":6},{"$f":"IF(M17*L17=0,\"\",VLOOKUP(L17,Lists!B$10:G$14,CEILING(M17-0.5,1)+1,TRUE))","v":""},{"$nulls":10},{"v":-10,"d":"-10.00"},{"v":-10,"d":"-10.00"},{"v":-10,"d":"-10.00"},{"v":-10,"d":"-10.00"}]
["R11",{"$nulls":5},{"$f":"IF(F18*E18=0,\"\",VLOOKUP(E18,Lists!B$10:G$14,CEILING(F18-0.5,1)+1,TRUE))","v":""},{"$nulls":6},{"$f":"IF(M18*L18=0,\"\",VLOOKUP(L18,Lists!B$10:G$14,CEILING(M18-0.5,1)+1,TRUE))","v":""},{"$nulls":10},{"v":-10,"d":"-10.00"},{"v":-10,"d":"-10.00"},{"v":-10,"d":"-10.00"},{"v":-10,"d":"-10.00"}]
["R12",{"$nulls":5},{"$f":"IF(F19*E19=0,\"\",VLOOKUP(E19,Lists!B$10:G$14,CEILING(F19-0.5,1)+1,TRUE))","v":""},{"$nulls":6},{"$f":"IF(M19*L19=0,\"\",VLOOKUP(L19,Lists!B$10:G$14,CEILING(M19-0.5,1)+1,TRUE))","v":""},{"$nulls":10},{"v":-10,"d":"-10.00"},{"v":-10,"d":"-10.00"},{"v":-10,"d":"-10.00"},{"v":-10,"d":"-10.00"}]
["R13",{"$nulls":5},{"$f":"IF(F20*E20=0,\"\",VLOOKUP(E20,Lists!B$10:G$14,CEILING(F20-0.5,1)+1,TRUE))","v":""},{"$nulls":6},{"$f":"IF(M20*L20=0,\"\",VLOOKUP(L20,Lists!B$10:G$14,CEILING(M20-0.5,1)+1,TRUE))","v":""},{"$nulls":10},{"v":-10,"d":"-10.00"},{"v":-10,"d":"-10.00"},{"v":-10,"d":"-10.00"},{"v":-10,"d":"-10.00"}]
["R14",{"$nulls":5},{"$f":"IF(F21*E21=0,\"\",VLOOKUP(E21,Lists!B$10:G$14,CEILING(F21-0.5,1)+1,TRUE))","v":""},{"$nulls":6},{"$f":"IF(M21*L21=0,\"\",VLOOKUP(L21,Lists!B$10:G$14,CEILING(M21-0.5,1)+1,TRUE))","v":""},{"$nulls":10},{"v":-10,"d":"-10.00"},{"v":-10,"d":"-10.00"},{"v":-10,"d":"-10.00"},{"v":-10,"d":"-10.00"}]
["R15",{"$nulls":5},{"$f":"IF(F22*E22=0,\"\",VLOOKUP(E22,Lists!B$10:G$14,CEILING(F22-0.5,1)+1,TRUE))","v":""},{"$nulls":6},{"$f":"IF(M22*L22=0,\"\",VLOOKUP(L22,Lists!B$10:G$14,CEILING(M22-0.5,1)+1,TRUE))","v":""},{"$nulls":10},{"v":-10,"d":"-10.00"},{"v":-10,"d":"-10.00"},{"v":-10,"d":"-10.00"},{"v":-10,"d":"-10.00"}]
["R16",{"$nulls":5},{"$f":"IF(F23*E23=0,\"\",VLOOKUP(E23,Lists!B$10:G$14,CEILING(F23-0.5,1)+1,TRUE))","v":""},{"$nulls":6},{"$f":"IF(M23*L23=0,\"\",VLOOKUP(L23,Lists!B$10:G$14,CEILING(M23-0.5,1)+1,TRUE))","v":""},{"$nulls":10},{"v":-10,"d":"-10.00"},{"v":-10,"d":"-10.00"},{"v":-10,"d":"-10.00"},{"v":-10,"d":"-10.00"}]
["R17",{"$nulls":5},{"$f":"IF(F24*E24=0,\"\",VLOOKUP(E24,Lists!B$10:G$14,CEILING(F24-0.5,1)+1,TRUE))","v":""},{"$nulls":6},{"$f":"IF(M24*L24=0,\"\",VLOOKUP(L24,Lists!B$10:G$14,CEILING(M24-0.5,1)+1,TRUE))","v":""},{"$nulls":10},{"v":-10,"d":"-10.00"},{"v":-10,"d":"-10.00"},{"v":-10,"d":"-10.00"},{"v":-10,"d":"-10.00"}]
["R18",{"$nulls":5},{"$f":"IF(F25*E25=0,\"\",VLOOKUP(E25,Lists!B$10:G$14,CEILING(F25-0.5,1)+1,TRUE))","v":""},{"$nulls":6},{"$f":"IF(M25*L25=0,\"\",VLOOKUP(L25,Lists!B$10:G$14,CEILING(M25-0.5,1)+1,TRUE))","v":""},{"$nulls":10},{"v":-10,"d":"-10.00"},{"v":-10,"d":"-10.00"},{"v":-10,"d":"-10.00"},{"v":-10,"d":"-10.00"}]
["R19",{"$nulls":5},{"$f":"IF(F26*E26=0,\"\",VLOOKUP(E26,Lists!B$10:G$14,CEILING(F26-0.5,1)+1,TRUE))","v":""},{"$nulls":6},{"$f":"IF(M26*L26=0,\"\",VLOOKUP(L26,Lists!B$10:G$14,CEILING(M26-0.5,1)+1,TRUE))","v":""},{"$nulls":10},{"v":-10,"d":"-10.00"},{"v":-10,"d":"-10.00"},{"v":-10,"d":"-10.00"},{"v":-10,"d":"-10.00"}]
["R20",{"$nulls":5},{"$f":"IF(F27*E27=0,\"\",VLOOKUP(E27,Lists!B$10:G$14,CEILING(F27-0.5,1)+1,TRUE))","v":""},{"$nulls":6},{"$f":"IF(M27*L27=0,\"\",VLOOKUP(L27,Lists!B$10:G$14,CEILING(M27-0.5,1)+1,TRUE))","v":""},{"$nulls":10},{"v":-10,"d":"-10.00"},{"v":-10,"d":"-10.00"},{"v":-10,"d":"-10.00"},{"v":-10,"d":"-10.00"}]
[{"$nulls":28},"X-forskyv","Y-forskyv"]
[{"$nulls":28},-0.85,-0.5]
[{"$nulls":24},"X-Konsekvens","Y-Sannsynlighet",null,null,-0.85,-0.25]
[{"$f":"A3","v":"Mål / krav nr 6:"},{"$nulls":22},"Gj sn",{"$f":"IF(F6=\"\",-10,F6-0.5)","v":{"v":-10,"d":"-10.00"}},{"$f":"IF(E6=\"\",-10,E6-0.5)","v":{"v":-10,"d":"-10.00"}},null,null,-0.85,-0.75]
[{"$f":"IF(A4=\"\",\"\",A4)","v":""},{"$nulls":23},{"$f":"IF(M6=\"\",Y31,M6-0.6)","v":{"v":-10,"d":"-10.00"}},{"$f":"IF(L6=\"\",Z31,L6-0.6)","v":{"v":-10,"d":"-10.00"}},null,null,-0.75,-0.5]
[{"$nulls":23},{"$f":"A8","v":"R1"},{"$f":"Y8","v":{"v":-10,"d":"-10.00"}},{"$f":"Z8","v":-10},null,null,-0.75,-0.25]
[null,null,"Når risikovurdering før og etter tiltak er utfylt er:",{"$nulls":21},{"$f":"AA8","v":{"v":-10,"d":"-10.00"}},{"$f":"AB8","v":-10},null,null,-0.75,-0.75]
[null,null,"● = Risikonivå før tiltak",{"$nulls":20},{"$f":"A9","v":"R2"},{"$f":"Y9","v":-10},{"$f":"Z9","v":-10},null,null,-0.66,-0.5]
[null,null,"■ = Risikonivå etter tiltak",{"$nulls":21},{"$f":"AA9","v":{"v":-10,"d":"-10.00"}},{"$f":"AB9","v":-10},null,null,-0.66,-0.25]
[{"$nulls":23},{"$f":"A10","v":"R3"},{"$f":"Y10","v":-10},{"$f":"Z10","v":-10},null,null,-0.66,-0.75]
[{"$nulls":24},{"$f":"AA10","v":-10},{"$f":"AB10","v":-10},null,null,-0.5,-0.5]
[{"$nulls":23},{"$f":"A11","v":"R4"},{"$f":"Y11","v":-10},{"$f":"Z11","v":-10},null,null,-0.5,-0.25]
[{"$nulls":24},{"$f":"AA11","v":-10},{"$f":"AB11","v":-10},null,null,-0.5,-0.75]
[{"$nulls":23},{"$f":"A12","v":"R5"},{"$f":"Y12","v":-10},{"$f":"Z12","v":-10},null,null,-0.33,-0.5]
[{"$nulls":24},{"$f":"AA12","v":-10},{"$f":"AB12","v":-10},null,null,-0.33,-0.25]
[{"$nulls":23},{"$f":"A13","v":"R6"},{"$f":"Y13","v":-10},{"$f":"Z13","v":-10},null,null,-0.33,-0.75]
[{"$nulls":24},{"$f":"AA13","v":-10},{"$f":"AB13","v":-10},null,null,-0.25,-0.5]
[{"$nulls":23},{"$f":"A14","v":"R7"},{"$f":"Y14","v":-10},{"$f":"Z14","v":-10},null,null,-0.25,-0.25]
[{"$nulls":24},{"$f":"AA14","v":-10},{"$f":"AB14","v":-10},null,null,-0.25,-0.75]
[{"$nulls":23},{"$f":"A15","v":"R8"},{"$f":"Y15","v":-10},{"$f":"Z15","v":-10},null,null,-0.15,-0.5]
[{"$nulls":24},{"$f":"AA15","v":-10},{"$f":"AB15","v":-10},null,null,-0.15,-0.25]
[{"$nulls":23},{"$f":"A16","v":"R9"},{"$f":"Y16","v":-10},{"$f":"Z16","v":-10}]
[{"$nulls":24},{"$f":"AA16","v":-10},{"$f":"AB16","v":-10}]
[{"$nulls":23},{"$f":"A17","v":"R10"},{"$f":"Y17","v":-10},{"$f":"Z17","v":-10}]
[{"$nulls":24},{"$f":"AA17","v":-10},{"$f":"AB17","v":-10}]
[{"$nulls":23},{"$f":"A18","v":"R11"},{"$f":"Y18","v":-10},{"$f":"Z18","v":-10}]
[{"$nulls":24},{"$f":"AA18","v":-10},{"$f":"AB18","v":-10}]
[{"$nulls":23},{"$f":"A19","v":"R12"},{"$f":"Y19","v":{"v":-10,"d":"-10.00"}},{"$f":"Z19","v":-10}]
[{"$nulls":24},{"$f":"AA19","v":-10},{"$f":"AB19","v":-10}]
[{"$nulls":23},{"$f":"A20","v":"R13"},{"$f":"Y20","v":-10},{"$f":"Z20","v":-10}]
[{"$nulls":24},{"$f":"AA20","v":-10},{"$f":"AB20","v":-10}]
[{"$nulls":23},{"$f":"A21","v":"R14"},{"$f":"Y21","v":-10},{"$f":"Z21","v":-10}]
[{"$nulls":24},{"$f":"AA21","v":-10},{"$f":"AB21","v":-10}]
[{"$nulls":23},{"$f":"A22","v":"R15"},{"$f":"Y22","v":-10},{"$f":"Z22","v":-10}]
[{"$nulls":24},{"$f":"AA22","v":-10},{"$f":"AB22","v":-10}]
[{"$nulls":23},{"$f":"A23","v":"R16"},{"$f":"Y23","v":{"v":-10,"d":"-10.00"}},{"$f":"Z23","v":{"v":-10,"d":"-10.00"}}]
[{"$nulls":24},{"$f":"AA23","v":{"v":-10,"d":"-10.00"}},{"$f":"AB23","v":{"v":-10,"d":"-10.00"}}]
[{"$nulls":23},{"$f":"A24","v":"R17"},{"$f":"Y24","v":{"v":-10,"d":"-10.00"}},{"$f":"Z24","v":{"v":-10,"d":"-10.00"}}]
[{"$nulls":24},{"$f":"AA24","v":{"v":-10,"d":"-10.00"}},{"$f":"AB24","v":{"v":-10,"d":"-10.00"}}]
[{"$nulls":23},{"$f":"A25","v":"R18"},{"$f":"Y25","v":{"v":-10,"d":"-10.00"}},{"$f":"Z25","v":{"v":-10,"d":"-10.00"}}]
[{"$nulls":24},{"$f":"AA25","v":{"v":-10,"d":"-10.00"}},{"$f":"AB25","v":{"v":-10,"d":"-10.00"}}]
[{"$nulls":23},{"$f":"A26","v":"R19"},{"$f":"Y26","v":{"v":-10,"d":"-10.00"}},{"$f":"Z26","v":{"v":-10,"d":"-10.00"}}]
[{"$nulls":24},{"$f":"AA26","v":{"v":-10,"d":"-10.00"}},{"$f":"AB26","v":{"v":-10,"d":"-10.00"}}]
[{"$nulls":23},{"$f":"A27","v":"R20"},{"$f":"Y27","v":{"v":-10,"d":"-10.00"}},{"$f":"Z27","v":{"v":-10,"d":"-10.00"}}]
[{"$nulls":24},{"$f":"AA27","v":{"v":-10,"d":"-10.00"}},{"$f":"AB27","v":{"v":-10,"d":"-10.00"}}]

{"sheet":"Mål 7","index":14,"n_rows":72,"n_cols":30,"rows_kept":72,"merged":[[0,0,0,3],[0,4,0,6],[0,7,0,8],[0,11,0,13],[1,2,1,3],[1,5,1,6],[1,12,1,13],[2,0,2,2],[2,4,2,6],[2,7,2,8],[2,11,2,13],[3,0,4,3],[3,4,3,5],[3,7,4,10],[3,11,3,12],[5,24,5,25],[5,26,5,27],[30,0,30,2],[31,0,32,3],[34,2,34,3],[35,2,35,3]]}
["Risikoidentifikasjon og analyse",{"$nulls":3},"Ansvarlig:",{"$nulls":6},"Risikomatrise, \nse under"]
["Enhet:",null,{"$f":"IF(Forside!C2=\"\",\"\",Forside!C2)","v":"Tjenesteområde <<tjenesteområde>>"},null,"Dato:",{"$f":"IF(Forside!C4=\"\",\"\",Forside!C4)","v":""}]
["Mål / krav nr 7:",{"$nulls":3},"Risiko før tiltak",null,null,"Deltakere i prosessen:",{"$nulls":3},"Risiko etter tiltak"]
[{"$nulls":4},"Risiko-vurdering",null,"Risiko-nivå",{"$f":"IF(Forside!C3=\"\",\"\",Forside!C3)","v":"<<deltakere>>"},{"$nulls":3},"Risiko-vurdering",null,"Risiko-nivå"]
[{"$nulls":4},"S","K",{"$nulls":5},"S","K"]
[{"$nulls":3},"Gjsn risiko for målet:",{"$f":"IF(ISERROR(AVERAGE(E8:E27)),\"\",ROUND(AVERAGE(E8:E27),0))","v":""},{"$f":"IF(ISERROR(AVERAGE(F8:F27)),\"\",ROUND(AVERAGE(F8:F27),0))","v":""},{"$f":"IF(ISERROR(E6*F6),\"\",VLOOKUP(E6,Lists!B$10:G$14,CEILING(F6-0.5,1)+1,TRUE))","v":""},{"$nulls":4},{"$f":"IF(ISERROR(AVERAGE(L8:L27)),\"\",ROUND(AVERAGE(L8:L27),0))","v":""},{"$f":"IF(ISERROR(AVERAGE(M8:M27)),\"\",ROUND(AVERAGE(M8:M27),0))","v":""},{"$f":"IF(ISERROR(L6*M6),\"\",VLOOKUP(L6,Lists!B$10:G$14,CEILING(M6-0.5,1)+1,TRUE))","v":""},{"$nulls":10},"Før tiltak",null,"Etter tiltak"]
["Risiko nr","Mulige hendelser/ risiko","Område","Eksisterende tiltak","S","K","Risiko-nivå","Risikoeier:","Nye tiltak:","Ansvarlig:","Frist:","S","K","Risiko-nivå",{"$nulls":10},"X-forskyv konsekv","Y-forskyv Sanns","X-forskyv konsekv","Y-forskyv Sanns"]
["R1",{"$nulls":5},{"$f":"IF(F8*E8=0,\"\",VLOOKUP(E8,Lists!B$10:G$14,CEILING(F8-0.5,1)+1,TRUE))","v":""},{"$nulls":6},{"$f":"IF(M8*L8=0,\"\",VLOOKUP(L8,Lists!B$10:G$14,CEILING(M8-0.5,1)+1,TRUE))","v":""},{"$nulls":10},{"$f":"IF(F8=\"\",-10,F8+AC29)","v":{"v":-10,"d":"-10.00"}},{"$f":"IF(E8=\"\",-10,E8+AD29)","v":{"v":-10,"d":"-10.00"}},{"$f":"IF(M8=\"\",Y8,M8+AC29)","v":{"v":-10,"d":"-10.00"}},{"$f":"IF(L8=\"\",Z8,L8+AD29)","v":{"v":-10,"d":"-10.00"}}]
["R2",{"$nulls":5},{"$f":"IF(F9*E9=0,\"\",VLOOKUP(E9,Lists!B$10:G$14,CEILING(F9-0.5,1)+1,TRUE))","v":""},{"$nulls":6},{"$f":"IF(M9*L9=0,\"\",VLOOKUP(L9,Lists!B$10:G$14,CEILING(M9-0.5,1)+1,TRUE))","v":""},{"$nulls":10},{"v":-10,"d":"-10.00"},{"v":-10,"d":"-10.00"},{"v":-10,"d":"-10.00"},{"v":-10,"d":"-10.00"}]
["R3",{"$nulls":5},{"$f":"IF(F10*E10=0,\"\",VLOOKUP(E10,Lists!B$10:G$14,CEILING(F10-0.5,1)+1,TRUE))","v":""},{"$nulls":6},{"$f":"IF(M10*L10=0,\"\",VLOOKUP(L10,Lists!B$10:G$14,CEILING(M10-0.5,1)+1,TRUE))","v":""},{"$nulls":10},{"v":-10,"d":"-10.00"},{"v":-10,"d":"-10.00"},{"v":-10,"d":"-10.00"},{"v":-10,"d":"-10.00"}]
["R4",{"$nulls":5},{"$f":"IF(F11*E11=0,\"\",VLOOKUP(E11,Lists!B$10:G$14,CEILING(F11-0.5,1)+1,TRUE))","v":""},{"$nulls":6},{"$f":"IF(M11*L11=0,\"\",VLOOKUP(L11,Lists!B$10:G$14,CEILING(M11-0.5,1)+1,TRUE))","v":""},{"$nulls":10},{"v":-10,"d":"-10.00"},{"v":-10,"d":"-10.00"},{"v":-10,"d":"-10.00"},{"v":-10,"d":"-10.00"}]
["R5",{"$nulls":5},{"$f":"IF(F12*E12=0,\"\",VLOOKUP(E12,Lists!B$10:G$14,CEILING(F12-0.5,1)+1,TRUE))","v":""},{"$nulls":6},{"$f":"IF(M12*L12=0,\"\",VLOOKUP(L12,Lists!B$10:G$14,CEILING(M12-0.5,1)+1,TRUE))","v":""},{"$nulls":10},{"v":-10,"d":"-10.00"},{"v":-10,"d":"-10.00"},{"v":-10,"d":"-10.00"},{"v":-10,"d":"-10.00"}]
["R6",{"$nulls":5},{"$f":"IF(F13*E13=0,\"\",VLOOKUP(E13,Lists!B$10:G$14,CEILING(F13-0.5,1)+1,TRUE))","v":""},{"$nulls":6},{"$f":"IF(M13*L13=0,\"\",VLOOKUP(L13,Lists!B$10:G$14,CEILING(M13-0.5,1)+1,TRUE))","v":""},{"$nulls":10},{"v":-10,"d":"-10.00"},{"v":-10,"d":"-10.00"},{"v":-10,"d":"-10.00"},{"v":-10,"d":"-10.00"}]
["R7",{"$nulls":5},{"$f":"IF(F14*E14=0,\"\",VLOOKUP(E14,Lists!B$10:G$14,CEILING(F14-0.5,1)+1,TRUE))","v":""},{"$nulls":6},{"$f":"IF(M14*L14=0,\"\",VLOOKUP(L14,Lists!B$10:G$14,CEILING(M14-0.5,1)+1,TRUE))","v":""},{"$nulls":10},{"v":-10,"d":"-10.00"},{"v":-10,"d":"-10.00"},{"v":-10,"d":"-10.00"},{"v":-10,"d":"-10.00"}]
["R8",{"$nulls":5},{"$f":"IF(F15*E15=0,\"\",VLOOKUP(E15,Lists!B$10:G$14,CEILING(F15-0.5,1)+1,TRUE))","v":""},{"$nulls":6},{"$f":"IF(M15*L15=0,\"\",VLOOKUP(L15,Lists!B$10:G$14,CEILING(M15-0.5,1)+1,TRUE))","v":""},{"$nulls":10},{"v":-10,"d":"-10.00"},{"v":-10,"d":"-10.00"},{"v":-10,"d":"-10.00"},{"v":-10,"d":"-10.00"}]
["R9",{"$nulls":5},{"$f":"IF(F16*E16=0,\"\",VLOOKUP(E16,Lists!B$10:G$14,CEILING(F16-0.5,1)+1,TRUE))","v":""},{"$nulls":6},{"$f":"IF(M16*L16=0,\"\",VLOOKUP(L16,Lists!B$10:G$14,CEILING(M16-0.5,1)+1,TRUE))","v":""},{"$nulls":10},{"v":-10,"d":"-10.00"},{"v":-10,"d":"-10.00"},{"v":-10,"d":"-10.00"},{"v":-10,"d":"-10.00"}]
["R10",{"$nulls":5},{"$f":"IF(F17*E17=0,\"\",VLOOKUP(E17,Lists!B$10:G$14,CEILING(F17-0.5,1)+1,TRUE))","v":""},{"$nulls":6},{"$f":"IF(M17*L17=0,\"\",VLOOKUP(L17,Lists!B$10:G$14,CEILING(M17-0.5,1)+1,TRUE))","v":""},{"$nulls":10},{"v":-10,"d":"-10.00"},{"v":-10,"d":"-10.00"},{"v":-10,"d":"-10.00"},{"v":-10,"d":"-10.00"}]
["R11",{"$nulls":5},{"$f":"IF(F18*E18=0,\"\",VLOOKUP(E18,Lists!B$10:G$14,CEILING(F18-0.5,1)+1,TRUE))","v":""},{"$nulls":6},{"$f":"IF(M18*L18=0,\"\",VLOOKUP(L18,Lists!B$10:G$14,CEILING(M18-0.5,1)+1,TRUE))","v":""},{"$nulls":10},{"v":-10,"d":"-10.00"},{"v":-10,"d":"-10.00"},{"v":-10,"d":"-10.00"},{"v":-10,"d":"-10.00"}]
["R12",{"$nulls":5},{"$f":"IF(F19*E19=0,\"\",VLOOKUP(E19,Lists!B$10:G$14,CEILING(F19-0.5,1)+1,TRUE))","v":""},{"$nulls":6},{"$f":"IF(M19*L19=0,\"\",VLOOKUP(L19,Lists!B$10:G$14,CEILING(M19-0.5,1)+1,TRUE))","v":""},{"$nulls":10},{"v":-10,"d":"-10.00"},{"v":-10,"d":"-10.00"},{"v":-10,"d":"-10.00"},{"v":-10,"d":"-10.00"}]
["R13",{"$nulls":5},{"$f":"IF(F20*E20=0,\"\",VLOOKUP(E20,Lists!B$10:G$14,CEILING(F20-0.5,1)+1,TRUE))","v":""},{"$nulls":6},{"$f":"IF(M20*L20=0,\"\",VLOOKUP(L20,Lists!B$10:G$14,CEILING(M20-0.5,1)+1,TRUE))","v":""},{"$nulls":10},{"v":-10,"d":"-10.00"},{"v":-10,"d":"-10.00"},{"v":-10,"d":"-10.00"},{"v":-10,"d":"-10.00"}]
["R14",{"$nulls":5},{"$f":"IF(F21*E21=0,\"\",VLOOKUP(E21,Lists!B$10:G$14,CEILING(F21-0.5,1)+1,TRUE))","v":""},{"$nulls":6},{"$f":"IF(M21*L21=0,\"\",VLOOKUP(L21,Lists!B$10:G$14,CEILING(M21-0.5,1)+1,TRUE))","v":""},{"$nulls":10},{"v":-10,"d":"-10.00"},{"v":-10,"d":"-10.00"},{"v":-10,"d":"-10.00"},{"v":-10,"d":"-10.00"}]
["R15",{"$nulls":5},{"$f":"IF(F22*E22=0,\"\",VLOOKUP(E22,Lists!B$10:G$14,CEILING(F22-0.5,1)+1,TRUE))","v":""},{"$nulls":6},{"$f":"IF(M22*L22=0,\"\",VLOOKUP(L22,Lists!B$10:G$14,CEILING(M22-0.5,1)+1,TRUE))","v":""},{"$nulls":10},{"v":-10,"d":"-10.00"},{"v":-10,"d":"-10.00"},{"v":-10,"d":"-10.00"},{"v":-10,"d":"-10.00"}]
["R16",{"$nulls":5},{"$f":"IF(F23*E23=0,\"\",VLOOKUP(E23,Lists!B$10:G$14,CEILING(F23-0.5,1)+1,TRUE))","v":""},{"$nulls":6},{"$f":"IF(M23*L23=0,\"\",VLOOKUP(L23,Lists!B$10:G$14,CEILING(M23-0.5,1)+1,TRUE))","v":""},{"$nulls":10},{"v":-10,"d":"-10.00"},{"v":-10,"d":"-10.00"},{"v":-10,"d":"-10.00"},{"v":-10,"d":"-10.00"}]
["R17",{"$nulls":5},{"$f":"IF(F24*E24=0,\"\",VLOOKUP(E24,Lists!B$10:G$14,CEILING(F24-0.5,1)+1,TRUE))","v":""},{"$nulls":6},{"$f":"IF(M24*L24=0,\"\",VLOOKUP(L24,Lists!B$10:G$14,CEILING(M24-0.5,1)+1,TRUE))","v":""},{"$nulls":10},{"v":-10,"d":"-10.00"},{"v":-10,"d":"-10.00"},{"v":-10,"d":"-10.00"},{"v":-10,"d":"-10.00"}]
["R18",{"$nulls":5},{"$f":"IF(F25*E25=0,\"\",VLOOKUP(E25,Lists!B$10:G$14,CEILING(F25-0.5,1)+1,TRUE))","v":""},{"$nulls":6},{"$f":"IF(M25*L25=0,\"\",VLOOKUP(L25,Lists!B$10:G$14,CEILING(M25-0.5,1)+1,TRUE))","v":""},{"$nulls":10},{"v":-10,"d":"-10.00"},{"v":-10,"d":"-10.00"},{"v":-10,"d":"-10.00"},{"v":-10,"d":"-10.00"}]
["R19",{"$nulls":5},{"$f":"IF(F26*E26=0,\"\",VLOOKUP(E26,Lists!B$10:G$14,CEILING(F26-0.5,1)+1,TRUE))","v":""},{"$nulls":6},{"$f":"IF(M26*L26=0,\"\",VLOOKUP(L26,Lists!B$10:G$14,CEILING(M26-0.5,1)+1,TRUE))","v":""},{"$nulls":10},{"v":-10,"d":"-10.00"},{"v":-10,"d":"-10.00"},{"v":-10,"d":"-10.00"},{"v":-10,"d":"-10.00"}]
["R20",{"$nulls":5},{"$f":"IF(F27*E27=0,\"\",VLOOKUP(E27,Lists!B$10:G$14,CEILING(F27-0.5,1)+1,TRUE))","v":""},{"$nulls":6},{"$f":"IF(M27*L27=0,\"\",VLOOKUP(L27,Lists!B$10:G$14,CEILING(M27-0.5,1)+1,TRUE))","v":""},{"$nulls":10},{"v":-10,"d":"-10.00"},{"v":-10,"d":"-10.00"},{"v":-10,"d":"-10.00"},{"v":-10,"d":"-10.00"}]
[{"$nulls":28},"X-forskyv","Y-forskyv"]
[{"$nulls":28},-0.85,-0.5]
[{"$nulls":24},"X-Konsekvens","Y-Sannsynlighet",null,null,-0.85,-0.25]
[{"$f":"A3","v":"Mål / krav nr 7:"},{"$nulls":22},"Gj sn",{"$f":"IF(F6=\"\",-10,F6-0.5)","v":{"v":-10,"d":"-10.00"}},{"$f":"IF(E6=\"\",-10,E6-0.5)","v":{"v":-10,"d":"-10.00"}},null,null,-0.85,-0.75]
[{"$f":"IF(A4=\"\",\"\",A4)","v":""},{"$nulls":23},{"$f":"IF(M6=\"\",Y31,M6-0.6)","v":{"v":-10,"d":"-10.00"}},{"$f":"IF(L6=\"\",Z31,L6-0.6)","v":{"v":-10,"d":"-10.00"}},null,null,-0.75,-0.5]
[{"$nulls":23},{"$f":"A8","v":"R1"},{"$f":"Y8","v":{"v":-10,"d":"-10.00"}},{"$f":"Z8","v":-10},null,null,-0.75,-0.25]
[null,null,"Når risikovurdering før og etter tiltak er utfylt er:",{"$nulls":21},{"$f":"AA8","v":{"v":-10,"d":"-10.00"}},{"$f":"AB8","v":-10},null,null,-0.75,-0.75]
[null,null,"● = Risikonivå før tiltak",{"$nulls":20},{"$f":"A9","v":"R2"},{"$f":"Y9","v":-10},{"$f":"Z9","v":-10},null,null,-0.66,-0.5]
[null,null,"■ = Risikonivå etter tiltak",{"$nulls":21},{"$f":"AA9","v":{"v":-10,"d":"-10.00"}},{"$f":"AB9","v":-10},null,null,-0.66,-0.25]
[{"$nulls":23},{"$f":"A10","v":"R3"},{"$f":"Y10","v":-10},{"$f":"Z10","v":-10},null,null,-0.66,-0.75]
[{"$nulls":24},{"$f":"AA10","v":-10},{"$f":"AB10","v":-10},null,null,-0.5,-0.5]
[{"$nulls":23},{"$f":"A11","v":"R4"},{"$f":"Y11","v":-10},{"$f":"Z11","v":-10},null,null,-0.5,-0.25]
[{"$nulls":24},{"$f":"AA11","v":-10},{"$f":"AB11","v":-10},null,null,-0.5,-0.75]
[{"$nulls":23},{"$f":"A12","v":"R5"},{"$f":"Y12","v":-10},{"$f":"Z12","v":-10},null,null,-0.33,-0.5]
[{"$nulls":24},{"$f":"AA12","v":-10},{"$f":"AB12","v":-10},null,null,-0.33,-0.25]
[{"$nulls":23},{"$f":"A13","v":"R6"},{"$f":"Y13","v":-10},{"$f":"Z13","v":-10},null,null,-0.33,-0.75]
[{"$nulls":24},{"$f":"AA13","v":-10},{"$f":"AB13","v":-10},null,null,-0.25,-0.5]
[{"$nulls":23},{"$f":"A14","v":"R7"},{"$f":"Y14","v":-10},{"$f":"Z14","v":-10},null,null,-0.25,-0.25]
[{"$nulls":24},{"$f":"AA14","v":-10},{"$f":"AB14","v":-10},null,null,-0.25,-0.75]
[{"$nulls":23},{"$f":"A15","v":"R8"},{"$f":"Y15","v":-10},{"$f":"Z15","v":-10},null,null,-0.15,-0.5]
[{"$nulls":24},{"$f":"AA15","v":-10},{"$f":"AB15","v":-10},null,null,-0.15,-0.25]
[{"$nulls":23},{"$f":"A16","v":"R9"},{"$f":"Y16","v":-10},{"$f":"Z16","v":-10}]
[{"$nulls":24},{"$f":"AA16","v":-10},{"$f":"AB16","v":-10}]
[{"$nulls":23},{"$f":"A17","v":"R10"},{"$f":"Y17","v":-10},{"$f":"Z17","v":-10}]
[{"$nulls":24},{"$f":"AA17","v":-10},{"$f":"AB17","v":-10}]
[{"$nulls":23},{"$f":"A18","v":"R11"},{"$f":"Y18","v":-10},{"$f":"Z18","v":-10}]
[{"$nulls":24},{"$f":"AA18","v":-10},{"$f":"AB18","v":-10}]
[{"$nulls":23},{"$f":"A19","v":"R12"},{"$f":"Y19","v":{"v":-10,"d":"-10.00"}},{"$f":"Z19","v":-10}]
[{"$nulls":24},{"$f":"AA19","v":-10},{"$f":"AB19","v":-10}]
[{"$nulls":23},{"$f":"A20","v":"R13"},{"$f":"Y20","v":-10},{"$f":"Z20","v":-10}]
[{"$nulls":24},{"$f":"AA20","v":-10},{"$f":"AB20","v":-10}]
[{"$nulls":23},{"$f":"A21","v":"R14"},{"$f":"Y21","v":-10},{"$f":"Z21","v":-10}]
[{"$nulls":24},{"$f":"AA21","v":-10},{"$f":"AB21","v":-10}]
[{"$nulls":23},{"$f":"A22","v":"R15"},{"$f":"Y22","v":-10},{"$f":"Z22","v":-10}]
[{"$nulls":24},{"$f":"AA22","v":-10},{"$f":"AB22","v":-10}]
[{"$nulls":23},{"$f":"A23","v":"R16"},{"$f":"Y23","v":{"v":-10,"d":"-10.00"}},{"$f":"Z23","v":{"v":-10,"d":"-10.00"}}]
[{"$nulls":24},{"$f":"AA23","v":{"v":-10,"d":"-10.00"}},{"$f":"AB23","v":{"v":-10,"d":"-10.00"}}]
[{"$nulls":23},{"$f":"A24","v":"R17"},{"$f":"Y24","v":{"v":-10,"d":"-10.00"}},{"$f":"Z24","v":{"v":-10,"d":"-10.00"}}]
[{"$nulls":24},{"$f":"AA24","v":{"v":-10,"d":"-10.00"}},{"$f":"AB24","v":{"v":-10,"d":"-10.00"}}]
[{"$nulls":23},{"$f":"A25","v":"R18"},{"$f":"Y25","v":{"v":-10,"d":"-10.00"}},{"$f":"Z25","v":{"v":-10,"d":"-10.00"}}]
[{"$nulls":24},{"$f":"AA25","v":{"v":-10,"d":"-10.00"}},{"$f":"AB25","v":{"v":-10,"d":"-10.00"}}]
[{"$nulls":23},{"$f":"A26","v":"R19"},{"$f":"Y26","v":{"v":-10,"d":"-10.00"}},{"$f":"Z26","v":{"v":-10,"d":"-10.00"}}]
[{"$nulls":24},{"$f":"AA26","v":{"v":-10,"d":"-10.00"}},{"$f":"AB26","v":{"v":-10,"d":"-10.00"}}]
[{"$nulls":23},{"$f":"A27","v":"R20"},{"$f":"Y27","v":{"v":-10,"d":"-10.00"}},{"$f":"Z27","v":{"v":-10,"d":"-10.00"}}]
[{"$nulls":24},{"$f":"AA27","v":{"v":-10,"d":"-10.00"}},{"$f":"AB27","v":{"v":-10,"d":"-10.00"}}]

{"sheet":"Mål 8","index":15,"n_rows":72,"n_cols":30,"rows_kept":72,"merged":[[0,0,0,3],[0,4,0,6],[0,7,0,8],[0,11,0,13],[1,2,1,3],[1,5,1,6],[1,12,1,13],[2,0,2,2],[2,4,2,6],[2,7,2,8],[2,11,2,13],[3,0,4,3],[3,4,3,5],[3,7,4,10],[3,11,3,12],[5,24,5,25],[5,26,5,27],[30,0,30,2],[31,0,32,3],[34,2,34,3],[35,2,35,3]]}
["Risikoidentifikasjon og analyse",{"$nulls":3},"Ansvarlig:",{"$nulls":6},"Risikomatrise, \nse under"]
["Enhet:",null,{"$f":"IF(Forside!C2=\"\",\"\",Forside!C2)","v":"Tjenesteområde <<tjenesteområde>>"},null,"Dato:",{"$f":"IF(Forside!C4=\"\",\"\",Forside!C4)","v":""}]
["Mål / krav nr 8:",{"$nulls":3},"Risiko før tiltak",null,null,"Deltakere i prosessen:",{"$nulls":3},"Risiko etter tiltak"]
[{"$nulls":4},"Risiko-vurdering",null,"Risiko-nivå",{"$f":"IF(Forside!C3=\"\",\"\",Forside!C3)","v":"<<deltakere>>"},{"$nulls":3},"Risiko-vurdering",null,"Risiko-nivå"]
[{"$nulls":4},"S","K",{"$nulls":5},"S","K"]
[{"$nulls":3},"Gjsn risiko for målet:",{"$f":"IF(ISERROR(AVERAGE(E8:E27)),\"\",ROUND(AVERAGE(E8:E27),0))","v":""},{"$f":"IF(ISERROR(AVERAGE(F8:F27)),\"\",ROUND(AVERAGE(F8:F27),0))","v":""},{"$f":"IF(ISERROR(E6*F6),\"\",VLOOKUP(E6,Lists!B$10:G$14,CEILING(F6-0.5,1)+1,TRUE))","v":""},{"$nulls":4},{"$f":"IF(ISERROR(AVERAGE(L8:L27)),\"\",ROUND(AVERAGE(L8:L27),0))","v":""},{"$f":"IF(ISERROR(AVERAGE(M8:M27)),\"\",ROUND(AVERAGE(M8:M27),0))","v":""},{"$f":"IF(ISERROR(L6*M6),\"\",VLOOKUP(L6,Lists!B$10:G$14,CEILING(M6-0.5,1)+1,TRUE))","v":""},{"$nulls":10},"Før tiltak",null,"Etter tiltak"]
["Risiko nr","Mulige hendelser/ risiko","Område","Eksisterende tiltak","S","K","Risiko-nivå","Risikoeier:","Nye tiltak:","Ansvarlig:","Frist:","S","K","Risiko-nivå",{"$nulls":10},"X-forskyv konsekv","Y-forskyv Sanns","X-forskyv konsekv","Y-forskyv Sanns"]
["R1",{"$nulls":5},{"$f":"IF(F8*E8=0,\"\",VLOOKUP(E8,Lists!B$10:G$14,CEILING(F8-0.5,1)+1,TRUE))","v":""},{"$nulls":6},{"$f":"IF(M8*L8=0,\"\",VLOOKUP(L8,Lists!B$10:G$14,CEILING(M8-0.5,1)+1,TRUE))","v":""},{"$nulls":10},{"$f":"IF(F8=\"\",-10,F8+AC29)","v":{"v":-10,"d":"-10.00"}},{"$f":"IF(E8=\"\",-10,E8+AD29)","v":{"v":-10,"d":"-10.00"}},{"$f":"IF(M8=\"\",Y8,M8+AC29)","v":{"v":-10,"d":"-10.00"}},{"$f":"IF(L8=\"\",Z8,L8+AD29)","v":{"v":-10,"d":"-10.00"}}]
["R2",{"$nulls":5},{"$f":"IF(F9*E9=0,\"\",VLOOKUP(E9,Lists!B$10:G$14,CEILING(F9-0.5,1)+1,TRUE))","v":""},{"$nulls":6},{"$f":"IF(M9*L9=0,\"\",VLOOKUP(L9,Lists!B$10:G$14,CEILING(M9-0.5,1)+1,TRUE))","v":""},{"$nulls":10},{"v":-10,"d":"-10.00"},{"v":-10,"d":"-10.00"},{"v":-10,"d":"-10.00"},{"v":-10,"d":"-10.00"}]
["R3",{"$nulls":5},{"$f":"IF(F10*E10=0,\"\",VLOOKUP(E10,Lists!B$10:G$14,CEILING(F10-0.5,1)+1,TRUE))","v":""},{"$nulls":6},{"$f":"IF(M10*L10=0,\"\",VLOOKUP(L10,Lists!B$10:G$14,CEILING(M10-0.5,1)+1,TRUE))","v":""},{"$nulls":10},{"v":-10,"d":"-10.00"},{"v":-10,"d":"-10.00"},{"v":-10,"d":"-10.00"},{"v":-10,"d":"-10.00"}]
["R4",{"$nulls":5},{"$f":"IF(F11*E11=0,\"\",VLOOKUP(E11,Lists!B$10:G$14,CEILING(F11-0.5,1)+1,TRUE))","v":""},{"$nulls":6},{"$f":"IF(M11*L11=0,\"\",VLOOKUP(L11,Lists!B$10:G$14,CEILING(M11-0.5,1)+1,TRUE))","v":""},{"$nulls":10},{"v":-10,"d":"-10.00"},{"v":-10,"d":"-10.00"},{"v":-10,"d":"-10.00"},{"v":-10,"d":"-10.00"}]
["R5",{"$nulls":5},{"$f":"IF(F12*E12=0,\"\",VLOOKUP(E12,Lists!B$10:G$14,CEILING(F12-0.5,1)+1,TRUE))","v":""},{"$nulls":6},{"$f":"IF(M12*L12=0,\"\",VLOOKUP(L12,Lists!B$10:G$14,CEILING(M12-0.5,1)+1,TRUE))","v":""},{"$nulls":10},{"v":-10,"d":"-10.00"},{"v":-10,"d":"-10.00"},{"v":-10,"d":"-10.00"},{"v":-10,"d":"-10.00"}]
["R6",{"$nulls":5},{"$f":"IF(F13*E13=0,\"\",VLOOKUP(E13,Lists!B$10:G$14,CEILING(F13-0.5,1)+1,TRUE))","v":""},{"$nulls":6},{"$f":"IF(M13*L13=0,\"\",VLOOKUP(L13,Lists!B$10:G$14,CEILING(M13-0.5,1)+1,TRUE))","v":""},{"$nulls":10},{"v":-10,"d":"-10.00"},{"v":-10,"d":"-10.00"},{"v":-10,"d":"-10.00"},{"v":-10,"d":"-10.00"}]
["R7",{"$nulls":5},{"$f":"IF(F14*E14=0,\"\",VLOOKUP(E14,Lists!B$10:G$14,CEILING(F14-0.5,1)+1,TRUE))","v":""},{"$nulls":6},{"$f":"IF(M14*L14=0,\"\",VLOOKUP(L14,Lists!B$10:G$14,CEILING(M14-0.5,1)+1,TRUE))","v":""},{"$nulls":10},{"v":-10,"d":"-10.00"},{"v":-10,"d":"-10.00"},{"v":-10,"d":"-10.00"},{"v":-10,"d":"-10.00"}]
["R8",{"$nulls":5},{"$f":"IF(F15*E15=0,\"\",VLOOKUP(E15,Lists!B$10:G$14,CEILING(F15-0.5,1)+1,TRUE))","v":""},{"$nulls":6},{"$f":"IF(M15*L15=0,\"\",VLOOKUP(L15,Lists!B$10:G$14,CEILING(M15-0.5,1)+1,TRUE))","v":""},{"$nulls":10},{"v":-10,"d":"-10.00"},{"v":-10,"d":"-10.00"},{"v":-10,"d":"-10.00"},{"v":-10,"d":"-10.00"}]
["R9",{"$nulls":5},{"$f":"IF(F16*E16=0,\"\",VLOOKUP(E16,Lists!B$10:G$14,CEILING(F16-0.5,1)+1,TRUE))","v":""},{"$nulls":6},{"$f":"IF(M16*L16=0,\"\",VLOOKUP(L16,Lists!B$10:G$14,CEILING(M16-0.5,1)+1,TRUE))","v":""},{"$nulls":10},{"v":-10,"d":"-10.00"},{"v":-10,"d":"-10.00"},{"v":-10,"d":"-10.00"},{"v":-10,"d":"-10.00"}]
["R10",{"$nulls":5},{"$f":"IF(F17*E17=0,\"\",VLOOKUP(E17,Lists!B$10:G$14,CEILING(F17-0.5,1)+1,TRUE))","v":""},{"$nulls":6},{"$f":"IF(M17*L17=0,\"\",VLOOKUP(L17,Lists!B$10:G$14,CEILING(M17-0.5,1)+1,TRUE))","v":""},{"$nulls":10},{"v":-10,"d":"-10.00"},{"v":-10,"d":"-10.00"},{"v":-10,"d":"-10.00"},{"v":-10,"d":"-10.00"}]
["R11",{"$nulls":5},{"$f":"IF(F18*E18=0,\"\",VLOOKUP(E18,Lists!B$10:G$14,CEILING(F18-0.5,1)+1,TRUE))","v":""},{"$nulls":6},{"$f":"IF(M18*L18=0,\"\",VLOOKUP(L18,Lists!B$10:G$14,CEILING(M18-0.5,1)+1,TRUE))","v":""},{"$nulls":10},{"v":-10,"d":"-10.00"},{"v":-10,"d":"-10.00"},{"v":-10,"d":"-10.00"},{"v":-10,"d":"-10.00"}]
["R12",{"$nulls":5},{"$f":"IF(F19*E19=0,\"\",VLOOKUP(E19,Lists!B$10:G$14,CEILING(F19-0.5,1)+1,TRUE))","v":""},{"$nulls":6},{"$f":"IF(M19*L19=0,\"\",VLOOKUP(L19,Lists!B$10:G$14,CEILING(M19-0.5,1)+1,TRUE))","v":""},{"$nulls":10},{"v":-10,"d":"-10.00"},{"v":-10,"d":"-10.00"},{"v":-10,"d":"-10.00"},{"v":-10,"d":"-10.00"}]
["R13",{"$nulls":5},{"$f":"IF(F20*E20=0,\"\",VLOOKUP(E20,Lists!B$10:G$14,CEILING(F20-0.5,1)+1,TRUE))","v":""},{"$nulls":6},{"$f":"IF(M20*L20=0,\"\",VLOOKUP(L20,Lists!B$10:G$14,CEILING(M20-0.5,1)+1,TRUE))","v":""},{"$nulls":10},{"v":-10,"d":"-10.00"},{"v":-10,"d":"-10.00"},{"v":-10,"d":"-10.00"},{"v":-10,"d":"-10.00"}]
["R14",{"$nulls":5},{"$f":"IF(F21*E21=0,\"\",VLOOKUP(E21,Lists!B$10:G$14,CEILING(F21-0.5,1)+1,TRUE))","v":""},{"$nulls":6},{"$f":"IF(M21*L21=0,\"\",VLOOKUP(L21,Lists!B$10:G$14,CEILING(M21-0.5,1)+1,TRUE))","v":""},{"$nulls":10},{"v":-10,"d":"-10.00"},{"v":-10,"d":"-10.00"},{"v":-10,"d":"-10.00"},{"v":-10,"d":"-10.00"}]
["R15",{"$nulls":5},{"$f":"IF(F22*E22=0,\"\",VLOOKUP(E22,Lists!B$10:G$14,CEILING(F22-0.5,1)+1,TRUE))","v":""},{"$nulls":6},{"$f":"IF(M22*L22=0,\"\",VLOOKUP(L22,Lists!B$10:G$14,CEILING(M22-0.5,1)+1,TRUE))","v":""},{"$nulls":10},{"v":-10,"d":"-10.00"},{"v":-10,"d":"-10.00"},{"v":-10,"d":"-10.00"},{"v":-10,"d":"-10.00"}]
["R16",{"$nulls":5},{"$f":"IF(F23*E23=0,\"\",VLOOKUP(E23,Lists!B$10:G$14,CEILING(F23-0.5,1)+1,TRUE))","v":""},{"$nulls":6},{"$f":"IF(M23*L23=0,\"\",VLOOKUP(L23,Lists!B$10:G$14,CEILING(M23-0.5,1)+1,TRUE))","v":""},{"$nulls":10},{"v":-10,"d":"-10.00"},{"v":-10,"d":"-10.00"},{"v":-10,"d":"-10.00"},{"v":-10,"d":"-10.00"}]
["R17",{"$nulls":5},{"$f":"IF(F24*E24=0,\"\",VLOOKUP(E24,Lists!B$10:G$14,CEILING(F24-0.5,1)+1,TRUE))","v":""},{"$nulls":6},{"$f":"IF(M24*L24=0,\"\",VLOOKUP(L24,Lists!B$10:G$14,CEILING(M24-0.5,1)+1,TRUE))","v":""},{"$nulls":10},{"v":-10,"d":"-10.00"},{"v":-10,"d":"-10.00"},{"v":-10,"d":"-10.00"},{"v":-10,"d":"-10.00"}]
["R18",{"$nulls":5},{"$f":"IF(F25*E25=0,\"\",VLOOKUP(E25,Lists!B$10:G$14,CEILING(F25-0.5,1)+1,TRUE))","v":""},{"$nulls":6},{"$f":"IF(M25*L25=0,\"\",VLOOKUP(L25,Lists!B$10:G$14,CEILING(M25-0.5,1)+1,TRUE))","v":""},{"$nulls":10},{"v":-10,"d":"-10.00"},{"v":-10,"d":"-10.00"},{"v":-10,"d":"-10.00"},{"v":-10,"d":"-10.00"}]
["R19",{"$nulls":5},{"$f":"IF(F26*E26=0,\"\",VLOOKUP(E26,Lists!B$10:G$14,CEILING(F26-0.5,1)+1,TRUE))","v":""},{"$nulls":6},{"$f":"IF(M26*L26=0,\"\",VLOOKUP(L26,Lists!B$10:G$14,CEILING(M26-0.5,1)+1,TRUE))","v":""},{"$nulls":10},{"v":-10,"d":"-10.00"},{"v":-10,"d":"-10.00"},{"v":-10,"d":"-10.00"},{"v":-10,"d":"-10.00"}]
["R20",{"$nulls":5},{"$f":"IF(F27*E27=0,\"\",VLOOKUP(E27,Lists!B$10:G$14,CEILING(F27-0.5,1)+1,TRUE))","v":""},{"$nulls":6},{"$f":"IF(M27*L27=0,\"\",VLOOKUP(L27,Lists!B$10:G$14,CEILING(M27-0.5,1)+1,TRUE))","v":""},{"$nulls":10},{"v":-10,"d":"-10.00"},{"v":-10,"d":"-10.00"},{"v":-10,"d":"-10.00"},{"v":-10,"d":"-10.00"}]
[{"$nulls":28},"X-forskyv","Y-forskyv"]
[{"$nulls":28},-0.85,-0.5]
[{"$nulls":24},"X-Konsekvens","Y-Sannsynlighet",null,null,-0.85,-0.25]
[{"$f":"A3","v":"Mål / krav nr 8:"},{"$nulls":22},"Gj sn",{"$f":"IF(F6=\"\",-10,F6-0.5)","v":{"v":-10,"d":"-10.00"}},{"$f":"IF(E6=\"\",-10,E6-0.5)","v":{"v":-10,"d":"-10.00"}},null,null,-0.85,-0.75]
[{"$f":"IF(A4=\"\",\"\",A4)","v":""},{"$nulls":23},{"$f":"IF(M6=\"\",Y31,M6-0.6)","v":{"v":-10,"d":"-10.00"}},{"$f":"IF(L6=\"\",Z31,L6-0.6)","v":{"v":-10,"d":"-10.00"}},null,null,-0.75,-0.5]
[{"$nulls":23},{"$f":"A8","v":"R1"},{"$f":"Y8","v":{"v":-10,"d":"-10.00"}},{"$f":"Z8","v":-10},null,null,-0.75,-0.25]
[null,null,"Når risikovurdering før og etter tiltak er utfylt er:",{"$nulls":21},{"$f":"AA8","v":{"v":-10,"d":"-10.00"}},{"$f":"AB8","v":-10},null,null,-0.75,-0.75]
[null,null,"● = Risikonivå før tiltak",{"$nulls":20},{"$f":"A9","v":"R2"},{"$f":"Y9","v":-10},{"$f":"Z9","v":-10},null,null,-0.66,-0.5]
[null,null,"■ = Risikonivå etter tiltak",{"$nulls":21},{"$f":"AA9","v":{"v":-10,"d":"-10.00"}},{"$f":"AB9","v":-10},null,null,-0.66,-0.25]
[{"$nulls":23},{"$f":"A10","v":"R3"},{"$f":"Y10","v":-10},{"$f":"Z10","v":-10},null,null,-0.66,-0.75]
[{"$nulls":24},{"$f":"AA10","v":-10},{"$f":"AB10","v":-10},null,null,-0.5,-0.5]
[{"$nulls":23},{"$f":"A11","v":"R4"},{"$f":"Y11","v":-10},{"$f":"Z11","v":-10},null,null,-0.5,-0.25]
[{"$nulls":24},{"$f":"AA11","v":-10},{"$f":"AB11","v":-10},null,null,-0.5,-0.75]
[{"$nulls":23},{"$f":"A12","v":"R5"},{"$f":"Y12","v":-10},{"$f":"Z12","v":-10},null,null,-0.33,-0.5]
[{"$nulls":24},{"$f":"AA12","v":-10},{"$f":"AB12","v":-10},null,null,-0.33,-0.25]
[{"$nulls":23},{"$f":"A13","v":"R6"},{"$f":"Y13","v":-10},{"$f":"Z13","v":-10},null,null,-0.33,-0.75]
[{"$nulls":24},{"$f":"AA13","v":-10},{"$f":"AB13","v":-10},null,null,-0.25,-0.5]
[{"$nulls":23},{"$f":"A14","v":"R7"},{"$f":"Y14","v":-10},{"$f":"Z14","v":-10},null,null,-0.25,-0.25]
[{"$nulls":24},{"$f":"AA14","v":-10},{"$f":"AB14","v":-10},null,null,-0.25,-0.75]
[{"$nulls":23},{"$f":"A15","v":"R8"},{"$f":"Y15","v":-10},{"$f":"Z15","v":-10},null,null,-0.15,-0.5]
[{"$nulls":24},{"$f":"AA15","v":-10},{"$f":"AB15","v":-10},null,null,-0.15,-0.25]
[{"$nulls":23},{"$f":"A16","v":"R9"},{"$f":"Y16","v":-10},{"$f":"Z16","v":-10}]
[{"$nulls":24},{"$f":"AA16","v":-10},{"$f":"AB16","v":-10}]
[{"$nulls":23},{"$f":"A17","v":"R10"},{"$f":"Y17","v":-10},{"$f":"Z17","v":-10}]
[{"$nulls":24},{"$f":"AA17","v":-10},{"$f":"AB17","v":-10}]
[{"$nulls":23},{"$f":"A18","v":"R11"},{"$f":"Y18","v":-10},{"$f":"Z18","v":-10}]
[{"$nulls":24},{"$f":"AA18","v":-10},{"$f":"AB18","v":-10}]
[{"$nulls":23},{"$f":"A19","v":"R12"},{"$f":"Y19","v":{"v":-10,"d":"-10.00"}},{"$f":"Z19","v":-10}]
[{"$nulls":24},{"$f":"AA19","v":-10},{"$f":"AB19","v":-10}]
[{"$nulls":23},{"$f":"A20","v":"R13"},{"$f":"Y20","v":-10},{"$f":"Z20","v":-10}]
[{"$nulls":24},{"$f":"AA20","v":-10},{"$f":"AB20","v":-10}]
[{"$nulls":23},{"$f":"A21","v":"R14"},{"$f":"Y21","v":-10},{"$f":"Z21","v":-10}]
[{"$nulls":24},{"$f":"AA21","v":-10},{"$f":"AB21","v":-10}]
[{"$nulls":23},{"$f":"A22","v":"R15"},{"$f":"Y22","v":-10},{"$f":"Z22","v":-10}]
[{"$nulls":24},{"$f":"AA22","v":-10},{"$f":"AB22","v":-10}]
[{"$nulls":23},{"$f":"A23","v":"R16"},{"$f":"Y23","v":{"v":-10,"d":"-10.00"}},{"$f":"Z23","v":{"v":-10,"d":"-10.00"}}]
[{"$nulls":24},{"$f":"AA23","v":{"v":-10,"d":"-10.00"}},{"$f":"AB23","v":{"v":-10,"d":"-10.00"}}]
[{"$nulls":23},{"$f":"A24","v":"R17"},{"$f":"Y24","v":{"v":-10,"d":"-10.00"}},{"$f":"Z24","v":{"v":-10,"d":"-10.00"}}]
[{"$nulls":24},{"$f":"AA24","v":{"v":-10,"d":"-10.00"}},{"$f":"AB24","v":{"v":-10,"d":"-10.00"}}]
[{"$nulls":23},{"$f":"A25","v":"R18"},{"$f":"Y25","v":{"v":-10,"d":"-10.00"}},{"$f":"Z25","v":{"v":-10,"d":"-10.00"}}]
[{"$nulls":24},{"$f":"AA25","v":{"v":-10,"d":"-10.00"}},{"$f":"AB25","v":{"v":-10,"d":"-10.00"}}]
[{"$nulls":23},{"$f":"A26","v":"R19"},{"$f":"Y26","v":{"v":-10,"d":"-10.00"}},{"$f":"Z26","v":{"v":-10,"d":"-10.00"}}]
[{"$nulls":24},{"$f":"AA26","v":{"v":-10,"d":"-10.00"}},{"$f":"AB26","v":{"v":-10,"d":"-10.00"}}]
[{"$nulls":23},{"$f":"A27","v":"R20"},{"$f":"Y27","v":{"v":-10,"d":"-10.00"}},{"$f":"Z27","v":{"v":-10,"d":"-10.00"}}]
[{"$nulls":24},{"$f":"AA27","v":{"v":-10,"d":"-10.00"}},{"$f":"AB27","v":{"v":-10,"d":"-10.00"}}]

{"sheet":"Mål 9","index":16,"n_rows":72,"n_cols":30,"rows_kept":72,"merged":[[0,0,0,3],[0,4,0,6],[0,7,0,8],[0,11,0,13],[1,2,1,3],[1,5,1,6],[1,12,1,13],[2,0,2,2],[2,4,2,6],[2,7,2,8],[2,11,2,13],[3,0,4,3],[3,4,3,5],[3,7,4,10],[3,11,3,12],[5,24,5,25],[5,26,5,27],[30,0,30,2],[31,0,32,3],[34,2,34,3],[35,2,35,3]]}
["Risikoidentifikasjon og analyse",{"$nulls":3},"Ansvarlig:",{"$nulls":6},"Risikomatrise, \nse under"]
["Enhet:",null,{"$f":"IF(Forside!C2=\"\",\"\",Forside!C2)","v":"Tjenesteområde <<tjenesteområde>>"},null,"Dato:",{"$f":"IF(Forside!C4=\"\",\"\",Forside!C4)","v":""}]
["Mål / krav nr 9:",{"$nulls":3},"Risiko før tiltak",null,null,"Deltakere i prosessen:",{"$nulls":3},"Risiko etter tiltak"]
[{"$nulls":4},"Risiko-vurdering",null,"Risiko-nivå",{"$f":"IF(Forside!C3=\"\",\"\",Forside!C3)","v":"<<deltakere>>"},{"$nulls":3},"Risiko-vurdering",null,"Risiko-nivå"]
[{"$nulls":4},"S","K",{"$nulls":5},"S","K"]
[{"$nulls":3},"Gjsn risiko for målet:",{"$f":"IF(ISERROR(AVERAGE(E8:E27)),\"\",ROUND(AVERAGE(E8:E27),0))","v":""},{"$f":"IF(ISERROR(AVERAGE(F8:F27)),\"\",ROUND(AVERAGE(F8:F27),0))","v":""},{"$f":"IF(ISERROR(E6*F6),\"\",VLOOKUP(E6,Lists!B$10:G$14,CEILING(F6-0.5,1)+1,TRUE))","v":""},{"$nulls":4},{"$f":"IF(ISERROR(AVERAGE(L8:L27)),\"\",ROUND(AVERAGE(L8:L27),0))","v":""},{"$f":"IF(ISERROR(AVERAGE(M8:M27)),\"\",ROUND(AVERAGE(M8:M27),0))","v":""},{"$f":"IF(ISERROR(L6*M6),\"\",VLOOKUP(L6,Lists!B$10:G$14,CEILING(M6-0.5,1)+1,TRUE))","v":""},{"$nulls":10},"Før tiltak",null,"Etter tiltak"]
["Risiko nr","Mulige hendelser/ risiko","Område","Eksisterende tiltak","S","K","Risiko-nivå","Risikoeier:","Nye tiltak:","Ansvarlig:","Frist:","S","K","Risiko-nivå",{"$nulls":10},"X-forskyv konsekv","Y-forskyv Sanns","X-forskyv konsekv","Y-forskyv Sanns"]
["R1",{"$nulls":5},{"$f":"IF(F8*E8=0,\"\",VLOOKUP(E8,Lists!B$10:G$14,CEILING(F8-0.5,1)+1,TRUE))","v":""},{"$nulls":6},{"$f":"IF(M8*L8=0,\"\",VLOOKUP(L8,Lists!B$10:G$14,CEILING(M8-0.5,1)+1,TRUE))","v":""},{"$nulls":10},{"$f":"IF(F8=\"\",-10,F8+AC29)","v":{"v":-10,"d":"-10.00"}},{"$f":"IF(E8=\"\",-10,E8+AD29)","v":{"v":-10,"d":"-10.00"}},{"$f":"IF(M8=\"\",Y8,M8+AC29)","v":{"v":-10,"d":"-10.00"}},{"$f":"IF(L8=\"\",Z8,L8+AD29)","v":{"v":-10,"d":"-10.00"}}]
["R2",{"$nulls":5},{"$f":"IF(F9*E9=0,\"\",VLOOKUP(E9,Lists!B$10:G$14,CEILING(F9-0.5,1)+1,TRUE))","v":""},{"$nulls":6},{"$f":"IF(M9*L9=0,\"\",VLOOKUP(L9,Lists!B$10:G$14,CEILING(M9-0.5,1)+1,TRUE))","v":""},{"$nulls":10},{"v":-10,"d":"-10.00"},{"v":-10,"d":"-10.00"},{"v":-10,"d":"-10.00"},{"v":-10,"d":"-10.00"}]
["R3",{"$nulls":5},{"$f":"IF(F10*E10=0,\"\",VLOOKUP(E10,Lists!B$10:G$14,CEILING(F10-0.5,1)+1,TRUE))","v":""},{"$nulls":6},{"$f":"IF(M10*L10=0,\"\",VLOOKUP(L10,Lists!B$10:G$14,CEILING(M10-0.5,1)+1,TRUE))","v":""},{"$nulls":10},{"v":-10,"d":"-10.00"},{"v":-10,"d":"-10.00"},{"v":-10,"d":"-10.00"},{"v":-10,"d":"-10.00"}]
["R4",{"$nulls":5},{"$f":"IF(F11*E11=0,\"\",VLOOKUP(E11,Lists!B$10:G$14,CEILING(F11-0.5,1)+1,TRUE))","v":""},{"$nulls":6},{"$f":"IF(M11*L11=0,\"\",VLOOKUP(L11,Lists!B$10:G$14,CEILING(M11-0.5,1)+1,TRUE))","v":""},{"$nulls":10},{"v":-10,"d":"-10.00"},{"v":-10,"d":"-10.00"},{"v":-10,"d":"-10.00"},{"v":-10,"d":"-10.00"}]
["R5",{"$nulls":5},{"$f":"IF(F12*E12=0,\"\",VLOOKUP(E12,Lists!B$10:G$14,CEILING(F12-0.5,1)+1,TRUE))","v":""},{"$nulls":6},{"$f":"IF(M12*L12=0,\"\",VLOOKUP(L12,Lists!B$10:G$14,CEILING(M12-0.5,1)+1,TRUE))","v":""},{"$nulls":10},{"v":-10,"d":"-10.00"},{"v":-10,"d":"-10.00"},{"v":-10,"d":"-10.00"},{"v":-10,"d":"-10.00"}]
["R6",{"$nulls":5},{"$f":"IF(F13*E13=0,\"\",VLOOKUP(E13,Lists!B$10:G$14,CEILING(F13-0.5,1)+1,TRUE))","v":""},{"$nulls":6},{"$f":"IF(M13*L13=0,\"\",VLOOKUP(L13,Lists!B$10:G$14,CEILING(M13-0.5,1)+1,TRUE))","v":""},{"$nulls":10},{"v":-10,"d":"-10.00"},{"v":-10,"d":"-10.00"},{"v":-10,"d":"-10.00"},{"v":-10,"d":"-10.00"}]
["R7",{"$nulls":5},{"$f":"IF(F14*E14=0,\"\",VLOOKUP(E14,Lists!B$10:G$14,CEILING(F14-0.5,1)+1,TRUE))","v":""},{"$nulls":6},{"$f":"IF(M14*L14=0,\"\",VLOOKUP(L14,Lists!B$10:G$14,CEILING(M14-0.5,1)+1,TRUE))","v":""},{"$nulls":10},{"v":-10,"d":"-10.00"},{"v":-10,"d":"-10.00"},{"v":-10,"d":"-10.00"},{"v":-10,"d":"-10.00"}]
["R8",{"$nulls":5},{"$f":"IF(F15*E15=0,\"\",VLOOKUP(E15,Lists!B$10:G$14,CEILING(F15-0.5,1)+1,TRUE))","v":""},{"$nulls":6},{"$f":"IF(M15*L15=0,\"\",VLOOKUP(L15,Lists!B$10:G$14,CEILING(M15-0.5,1)+1,TRUE))","v":""},{"$nulls":10},{"v":-10,"d":"-10.00"},{"v":-10,"d":"-10.00"},{"v":-10,"d":"-10.00"},{"v":-10,"d":"-10.00"}]
["R9",{"$nulls":5},{"$f":"IF(F16*E16=0,\"\",VLOOKUP(E16,Lists!B$10:G$14,CEILING(F16-0.5,1)+1,TRUE))","v":""},{"$nulls":6},{"$f":"IF(M16*L16=0,\"\",VLOOKUP(L16,Lists!B$10:G$14,CEILING(M16-0.5,1)+1,TRUE))","v":""},{"$nulls":10},{"v":-10,"d":"-10.00"},{"v":-10,"d":"-10.00"},{"v":-10,"d":"-10.00"},{"v":-10,"d":"-10.00"}]
["R10",{"$nulls":5},{"$f":"IF(F17*E17=0,\"\",VLOOKUP(E17,Lists!B$10:G$14,CEILING(F17-0.5,1)+1,TRUE))","v":""},{"$nulls":6},{"$f":"IF(M17*L17=0,\"\",VLOOKUP(L17,Lists!B$10:G$14,CEILING(M17-0.5,1)+1,TRUE))","v":""},{"$nulls":10},{"v":-10,"d":"-10.00"},{"v":-10,"d":"-10.00"},{"v":-10,"d":"-10.00"},{"v":-10,"d":"-10.00"}]
["R11",{"$nulls":5},{"$f":"IF(F18*E18=0,\"\",VLOOKUP(E18,Lists!B$10:G$14,CEILING(F18-0.5,1)+1,TRUE))","v":""},{"$nulls":6},{"$f":"IF(M18*L18=0,\"\",VLOOKUP(L18,Lists!B$10:G$14,CEILING(M18-0.5,1)+1,TRUE))","v":""},{"$nulls":10},{"v":-10,"d":"-10.00"},{"v":-10,"d":"-10.00"},{"v":-10,"d":"-10.00"},{"v":-10,"d":"-10.00"}]
["R12",{"$nulls":5},{"$f":"IF(F19*E19=0,\"\",VLOOKUP(E19,Lists!B$10:G$14,CEILING(F19-0.5,1)+1,TRUE))","v":""},{"$nulls":6},{"$f":"IF(M19*L19=0,\"\",VLOOKUP(L19,Lists!B$10:G$14,CEILING(M19-0.5,1)+1,TRUE))","v":""},{"$nulls":10},{"v":-10,"d":"-10.00"},{"v":-10,"d":"-10.00"},{"v":-10,"d":"-10.00"},{"v":-10,"d":"-10.00"}]
["R13",{"$nulls":5},{"$f":"IF(F20*E20=0,\"\",VLOOKUP(E20,Lists!B$10:G$14,CEILING(F20-0.5,1)+1,TRUE))","v":""},{"$nulls":6},{"$f":"IF(M20*L20=0,\"\",VLOOKUP(L20,Lists!B$10:G$14,CEILING(M20-0.5,1)+1,TRUE))","v":""},{"$nulls":10},{"v":-10,"d":"-10.00"},{"v":-10,"d":"-10.00"},{"v":-10,"d":"-10.00"},{"v":-10,"d":"-10.00"}]
["R14",{"$nulls":5},{"$f":"IF(F21*E21=0,\"\",VLOOKUP(E21,Lists!B$10:G$14,CEILING(F21-0.5,1)+1,TRUE))","v":""},{"$nulls":6},{"$f":"IF(M21*L21=0,\"\",VLOOKUP(L21,Lists!B$10:G$14,CEILING(M21-0.5,1)+1,TRUE))","v":""},{"$nulls":10},{"v":-10,"d":"-10.00"},{"v":-10,"d":"-10.00"},{"v":-10,"d":"-10.00"},{"v":-10,"d":"-10.00"}]
["R15",{"$nulls":5},{"$f":"IF(F22*E22=0,\"\",VLOOKUP(E22,Lists!B$10:G$14,CEILING(F22-0.5,1)+1,TRUE))","v":""},{"$nulls":6},{"$f":"IF(M22*L22=0,\"\",VLOOKUP(L22,Lists!B$10:G$14,CEILING(M22-0.5,1)+1,TRUE))","v":""},{"$nulls":10},{"v":-10,"d":"-10.00"},{"v":-10,"d":"-10.00"},{"v":-10,"d":"-10.00"},{"v":-10,"d":"-10.00"}]
["R16",{"$nulls":5},{"$f":"IF(F23*E23=0,\"\",VLOOKUP(E23,Lists!B$10:G$14,CEILING(F23-0.5,1)+1,TRUE))","v":""},{"$nulls":6},{"$f":"IF(M23*L23=0,\"\",VLOOKUP(L23,Lists!B$10:G$14,CEILING(M23-0.5,1)+1,TRUE))","v":""},{"$nulls":10},{"v":-10,"d":"-10.00"},{"v":-10,"d":"-10.00"},{"v":-10,"d":"-10.00"},{"v":-10,"d":"-10.00"}]
["R17",{"$nulls":5},{"$f":"IF(F24*E24=0,\"\",VLOOKUP(E24,Lists!B$10:G$14,CEILING(F24-0.5,1)+1,TRUE))","v":""},{"$nulls":6},{"$f":"IF(M24*L24=0,\"\",VLOOKUP(L24,Lists!B$10:G$14,CEILING(M24-0.5,1)+1,TRUE))","v":""},{"$nulls":10},{"v":-10,"d":"-10.00"},{"v":-10,"d":"-10.00"},{"v":-10,"d":"-10.00"},{"v":-10,"d":"-10.00"}]
["R18",{"$nulls":5},{"$f":"IF(F25*E25=0,\"\",VLOOKUP(E25,Lists!B$10:G$14,CEILING(F25-0.5,1)+1,TRUE))","v":""},{"$nulls":6},{"$f":"IF(M25*L25=0,\"\",VLOOKUP(L25,Lists!B$10:G$14,CEILING(M25-0.5,1)+1,TRUE))","v":""},{"$nulls":10},{"v":-10,"d":"-10.00"},{"v":-10,"d":"-10.00"},{"v":-10,"d":"-10.00"},{"v":-10,"d":"-10.00"}]
["R19",{"$nulls":5},{"$f":"IF(F26*E26=0,\"\",VLOOKUP(E26,Lists!B$10:G$14,CEILING(F26-0.5,1)+1,TRUE))","v":""},{"$nulls":6},{"$f":"IF(M26*L26=0,\"\",VLOOKUP(L26,Lists!B$10:G$14,CEILING(M26-0.5,1)+1,TRUE))","v":""},{"$nulls":10},{"v":-10,"d":"-10.00"},{"v":-10,"d":"-10.00"},{"v":-10,"d":"-10.00"},{"v":-10,"d":"-10.00"}]
["R20",{"$nulls":5},{"$f":"IF(F27*E27=0,\"\",VLOOKUP(E27,Lists!B$10:G$14,CEILING(F27-0.5,1)+1,TRUE))","v":""},{"$nulls":6},{"$f":"IF(M27*L27=0,\"\",VLOOKUP(L27,Lists!B$10:G$14,CEILING(M27-0.5,1)+1,TRUE))","v":""},{"$nulls":10},{"v":-10,"d":"-10.00"},{"v":-10,"d":"-10.00"},{"v":-10,"d":"-10.00"},{"v":-10,"d":"-10.00"}]
[{"$nulls":28},"X-forskyv","Y-forskyv"]
[{"$nulls":28},-0.85,-0.5]
[{"$nulls":24},"X-Konsekvens","Y-Sannsynlighet",null,null,-0.85,-0.25]
[{"$f":"A3","v":"Mål / krav nr 9:"},{"$nulls":22},"Gj sn",{"$f":"IF(F6=\"\",-10,F6-0.5)","v":{"v":-10,"d":"-10.00"}},{"$f":"IF(E6=\"\",-10,E6-0.5)","v":{"v":-10,"d":"-10.00"}},null,null,-0.85,-0.75]
[{"$f":"IF(A4=\"\",\"\",A4)","v":""},{"$nulls":23},{"$f":"IF(M6=\"\",Y31,M6-0.6)","v":{"v":-10,"d":"-10.00"}},{"$f":"IF(L6=\"\",Z31,L6-0.6)","v":{"v":-10,"d":"-10.00"}},null,null,-0.75,-0.5]
[{"$nulls":23},{"$f":"A8","v":"R1"},{"$f":"Y8","v":{"v":-10,"d":"-10.00"}},{"$f":"Z8","v":-10},null,null,-0.75,-0.25]
[null,null,"Når risikovurdering før og etter tiltak er utfylt er:",{"$nulls":21},{"$f":"AA8","v":{"v":-10,"d":"-10.00"}},{"$f":"AB8","v":-10},null,null,-0.75,-0.75]
[null,null,"● = Risikonivå før tiltak",{"$nulls":20},{"$f":"A9","v":"R2"},{"$f":"Y9","v":-10},{"$f":"Z9","v":-10},null,null,-0.66,-0.5]
[null,null,"■ = Risikonivå etter tiltak",{"$nulls":21},{"$f":"AA9","v":{"v":-10,"d":"-10.00"}},{"$f":"AB9","v":-10},null,null,-0.66,-0.25]
[{"$nulls":23},{"$f":"A10","v":"R3"},{"$f":"Y10","v":-10},{"$f":"Z10","v":-10},null,null,-0.66,-0.75]
[{"$nulls":24},{"$f":"AA10","v":-10},{"$f":"AB10","v":-10},null,null,-0.5,-0.5]
[{"$nulls":23},{"$f":"A11","v":"R4"},{"$f":"Y11","v":-10},{"$f":"Z11","v":-10},null,null,-0.5,-0.25]
[{"$nulls":24},{"$f":"AA11","v":-10},{"$f":"AB11","v":-10},null,null,-0.5,-0.75]
[{"$nulls":23},{"$f":"A12","v":"R5"},{"$f":"Y12","v":-10},{"$f":"Z12","v":-10},null,null,-0.33,-0.5]
[{"$nulls":24},{"$f":"AA12","v":-10},{"$f":"AB12","v":-10},null,null,-0.33,-0.25]
[{"$nulls":23},{"$f":"A13","v":"R6"},{"$f":"Y13","v":-10},{"$f":"Z13","v":-10},null,null,-0.33,-0.75]
[{"$nulls":24},{"$f":"AA13","v":-10},{"$f":"AB13","v":-10},null,null,-0.25,-0.5]
[{"$nulls":23},{"$f":"A14","v":"R7"},{"$f":"Y14","v":-10},{"$f":"Z14","v":-10},null,null,-0.25,-0.25]
[{"$nulls":24},{"$f":"AA14","v":-10},{"$f":"AB14","v":-10},null,null,-0.25,-0.75]
[{"$nulls":23},{"$f":"A15","v":"R8"},{"$f":"Y15","v":-10},{"$f":"Z15","v":-10},null,null,-0.15,-0.5]
[{"$nulls":24},{"$f":"AA15","v":-10},{"$f":"AB15","v":-10},null,null,-0.15,-0.25]
[{"$nulls":23},{"$f":"A16","v":"R9"},{"$f":"Y16","v":-10},{"$f":"Z16","v":-10}]
[{"$nulls":24},{"$f":"AA16","v":-10},{"$f":"AB16","v":-10}]
[{"$nulls":23},{"$f":"A17","v":"R10"},{"$f":"Y17","v":-10},{"$f":"Z17","v":-10}]
[{"$nulls":24},{"$f":"AA17","v":-10},{"$f":"AB17","v":-10}]
[{"$nulls":23},{"$f":"A18","v":"R11"},{"$f":"Y18","v":-10},{"$f":"Z18","v":-10}]
[{"$nulls":24},{"$f":"AA18","v":-10},{"$f":"AB18","v":-10}]
[{"$nulls":23},{"$f":"A19","v":"R12"},{"$f":"Y19","v":{"v":-10,"d":"-10.00"}},{"$f":"Z19","v":-10}]
[{"$nulls":24},{"$f":"AA19","v":-10},{"$f":"AB19","v":-10}]
[{"$nulls":23},{"$f":"A20","v":"R13"},{"$f":"Y20","v":-10},{"$f":"Z20","v":-10}]
[{"$nulls":24},{"$f":"AA20","v":-10},{"$f":"AB20","v":-10}]
[{"$nulls":23},{"$f":"A21","v":"R14"},{"$f":"Y21","v":-10},{"$f":"Z21","v":-10}]
[{"$nulls":24},{"$f":"AA21","v":-10},{"$f":"AB21","v":-10}]
[{"$nulls":23},{"$f":"A22","v":"R15"},{"$f":"Y22","v":-10},{"$f":"Z22","v":-10}]
[{"$nulls":24},{"$f":"AA22","v":-10},{"$f":"AB22","v":-10}]
[{"$nulls":23},{"$f":"A23","v":"R16"},{"$f":"Y23","v":{"v":-10,"d":"-10.00"}},{"$f":"Z23","v":{"v":-10,"d":"-10.00"}}]
[{"$nulls":24},{"$f":"AA23","v":{"v":-10,"d":"-10.00"}},{"$f":"AB23","v":{"v":-10,"d":"-10.00"}}]
[{"$nulls":23},{"$f":"A24","v":"R17"},{"$f":"Y24","v":{"v":-10,"d":"-10.00"}},{"$f":"Z24","v":{"v":-10,"d":"-10.00"}}]
[{"$nulls":24},{"$f":"AA24","v":{"v":-10,"d":"-10.00"}},{"$f":"AB24","v":{"v":-10,"d":"-10.00"}}]
[{"$nulls":23},{"$f":"A25","v":"R18"},{"$f":"Y25","v":{"v":-10,"d":"-10.00"}},{"$f":"Z25","v":{"v":-10,"d":"-10.00"}}]
[{"$nulls":24},{"$f":"AA25","v":{"v":-10,"d":"-10.00"}},{"$f":"AB25","v":{"v":-10,"d":"-10.00"}}]
[{"$nulls":23},{"$f":"A26","v":"R19"},{"$f":"Y26","v":{"v":-10,"d":"-10.00"}},{"$f":"Z26","v":{"v":-10,"d":"-10.00"}}]
[{"$nulls":24},{"$f":"AA26","v":{"v":-10,"d":"-10.00"}},{"$f":"AB26","v":{"v":-10,"d":"-10.00"}}]
[{"$nulls":23},{"$f":"A27","v":"R20"},{"$f":"Y27","v":{"v":-10,"d":"-10.00"}},{"$f":"Z27","v":{"v":-10,"d":"-10.00"}}]
[{"$nulls":24},{"$f":"AA27","v":{"v":-10,"d":"-10.00"}},{"$f":"AB27","v":{"v":-10,"d":"-10.00"}}]

{"sheet":"Mål 10","index":17,"n_rows":72,"n_cols":30,"rows_kept":72,"merged":[[0,0,0,3],[0,4,0,6],[0,7,0,8],[0,11,0,13],[1,2,1,3],[1,5,1,6],[1,12,1,13],[2,0,2,2],[2,4,2,6],[2,7,2,8],[2,11,2,13],[3,0,4,3],[3,4,3,5],[3,7,4,10],[3,11,3,12],[5,24,5,25],[5,26,5,27],[30,0,30,2],[31,0,32,3],[34,2,34,3],[35,2,35,3]]}
["Risikoidentifikasjon og analyse",{"$nulls":3},"Ansvarlig:",{"$nulls":6},"Risikomatrise, \nse under"]
["Enhet:",null,{"$f":"IF(Forside!C2=\"\",\"\",Forside!C2)","v":"Tjenesteområde <<tjenesteområde>>"},null,"Dato:",{"$f":"IF(Forside!C4=\"\",\"\",Forside!C4)","v":""}]
["Mål / krav nr 10:",{"$nulls":3},"Risiko før tiltak",null,null,"Deltakere i prosessen:",{"$nulls":3},"Risiko etter tiltak"]
[{"$nulls":4},"Risiko-vurdering",null,"Risiko-nivå",{"$f":"IF(Forside!C3=\"\",\"\",Forside!C3)","v":"<<deltakere>>"},{"$nulls":3},"Risiko-vurdering",null,"Risiko-nivå"]
[{"$nulls":4},"S","K",{"$nulls":5},"S","K"]
[{"$nulls":3},"Gjsn risiko for målet:",{"$f":"IF(ISERROR(AVERAGE(E8:E27)),\"\",ROUND(AVERAGE(E8:E27),0))","v":""},{"$f":"IF(ISERROR(AVERAGE(F8:F27)),\"\",ROUND(AVERAGE(F8:F27),0))","v":""},{"$f":"IF(ISERROR(E6*F6),\"\",VLOOKUP(E6,Lists!B$10:G$14,CEILING(F6-0.5,1)+1,TRUE))","v":""},{"$nulls":4},{"$f":"IF(ISERROR(AVERAGE(L8:L27)),\"\",ROUND(AVERAGE(L8:L27),0))","v":""},{"$f":"IF(ISERROR(AVERAGE(M8:M27)),\"\",ROUND(AVERAGE(M8:M27),0))","v":""},{"$f":"IF(ISERROR(L6*M6),\"\",VLOOKUP(L6,Lists!B$10:G$14,CEILING(M6-0.5,1)+1,TRUE))","v":""},{"$nulls":10},"Før tiltak",null,"Etter tiltak"]
["Risiko nr","Mulige hendelser/ risiko","Område","Eksisterende tiltak","S","K","Risiko-nivå","Risikoeier:","Nye tiltak:","Ansvarlig:","Frist:","S","K","Risiko-nivå",{"$nulls":10},"X-forskyv konsekv","Y-forskyv Sanns","X-forskyv konsekv","Y-forskyv Sanns"]
["R1",{"$nulls":5},{"$f":"IF(F8*E8=0,\"\",VLOOKUP(E8,Lists!B$10:G$14,CEILING(F8-0.5,1)+1,TRUE))","v":""},{"$nulls":6},{"$f":"IF(M8*L8=0,\"\",VLOOKUP(L8,Lists!B$10:G$14,CEILING(M8-0.5,1)+1,TRUE))","v":""},{"$nulls":10},{"$f":"IF(F8=\"\",-10,F8+AC29)","v":{"v":-10,"d":"-10.00"}},{"$f":"IF(E8=\"\",-10,E8+AD29)","v":{"v":-10,"d":"-10.00"}},{"$f":"IF(M8=\"\",Y8,M8+AC29)","v":{"v":-10,"d":"-10.00"}},{"$f":"IF(L8=\"\",Z8,L8+AD29)","v":{"v":-10,"d":"-10.00"}}]
["R2",{"$nulls":5},{"$f":"IF(F9*E9=0,\"\",VLOOKUP(E9,Lists!B$10:G$14,CEILING(F9-0.5,1)+1,TRUE))","v":""},{"$nulls":6},{"$f":"IF(M9*L9=0,\"\",VLOOKUP(L9,Lists!B$10:G$14,CEILING(M9-0.5,1)+1,TRUE))","v":""},{"$nulls":10},{"v":-10,"d":"-10.00"},{"v":-10,"d":"-10.00"},{"v":-10,"d":"-10.00"},{"v":-10,"d":"-10.00"}]
["R3",{"$nulls":5},{"$f":"IF(F10*E10=0,\"\",VLOOKUP(E10,Lists!B$10:G$14,CEILING(F10-0.5,1)+1,TRUE))","v":""},{"$nulls":6},{"$f":"IF(M10*L10=0,\"\",VLOOKUP(L10,Lists!B$10:G$14,CEILING(M10-0.5,1)+1,TRUE))","v":""},{"$nulls":10},{"v":-10,"d":"-10.00"},{"v":-10,"d":"-10.00"},{"v":-10,"d":"-10.00"},{"v":-10,"d":"-10.00"}]
["R4",{"$nulls":5},{"$f":"IF(F11*E11=0,\"\",VLOOKUP(E11,Lists!B$10:G$14,CEILING(F11-0.5,1)+1,TRUE))","v":""},{"$nulls":6},{"$f":"IF(M11*L11=0,\"\",VLOOKUP(L11,Lists!B$10:G$14,CEILING(M11-0.5,1)+1,TRUE))","v":""},{"$nulls":10},{"v":-10,"d":"-10.00"},{"v":-10,"d":"-10.00"},{"v":-10,"d":"-10.00"},{"v":-10,"d":"-10.00"}]
["R5",{"$nulls":5},{"$f":"IF(F12*E12=0,\"\",VLOOKUP(E12,Lists!B$10:G$14,CEILING(F12-0.5,1)+1,TRUE))","v":""},{"$nulls":6},{"$f":"IF(M12*L12=0,\"\",VLOOKUP(L12,Lists!B$10:G$14,CEILING(M12-0.5,1)+1,TRUE))","v":""},{"$nulls":10},{"v":-10,"d":"-10.00"},{"v":-10,"d":"-10.00"},{"v":-10,"d":"-10.00"},{"v":-10,"d":"-10.00"}]
["R6",{"$nulls":5},{"$f":"IF(F13*E13=0,\"\",VLOOKUP(E13,Lists!B$10:G$14,CEILING(F13-0.5,1)+1,TRUE))","v":""},{"$nulls":6},{"$f":"IF(M13*L13=0,\"\",VLOOKUP(L13,Lists!B$10:G$14,CEILING(M13-0.5,1)+1,TRUE))","v":""},{"$nulls":10},{"v":-10,"d":"-10.00"},{"v":-10,"d":"-10.00"},{"v":-10,"d":"-10.00"},{"v":-10,"d":"-10.00"}]
["R7",{"$nulls":5},{"$f":"IF(F14*E14=0,\"\",VLOOKUP(E14,Lists!B$10:G$14,CEILING(F14-0.5,1)+1,TRUE))","v":""},{"$nulls":6},{"$f":"IF(M14*L14=0,\"\",VLOOKUP(L14,Lists!B$10:G$14,CEILING(M14-0.5,1)+1,TRUE))","v":""},{"$nulls":10},{"v":-10,"d":"-10.00"},{"v":-10,"d":"-10.00"},{"v":-10,"d":"-10.00"},{"v":-10,"d":"-10.00"}]
["R8",{"$nulls":5},{"$f":"IF(F15*E15=0,\"\",VLOOKUP(E15,Lists!B$10:G$14,CEILING(F15-0.5,1)+1,TRUE))","v":""},{"$nulls":6},{"$f":"IF(M15*L15=0,\"\",VLOOKUP(L15,Lists!B$10:G$14,CEILING(M15-0.5,1)+1,TRUE))","v":""},{"$nulls":10},{"v":-10,"d":"-10.00"},{"v":-10,"d":"-10.00"},{"v":-10,"d":"-10.00"},{"v":-10,"d":"-10.00"}]
["R9",{"$nulls":5},{"$f":"IF(F16*E16=0,\"\",VLOOKUP(E16,Lists!B$10:G$14,CEILING(F16-0.5,1)+1,TRUE))","v":""},{"$nulls":6},{"$f":"IF(M16*L16=0,\"\",VLOOKUP(L16,Lists!B$10:G$14,CEILING(M16-0.5,1)+1,TRUE))","v":""},{"$nulls":10},{"v":-10,"d":"-10.00"},{"v":-10,"d":"-10.00"},{"v":-10,"d":"-10.00"},{"v":-10,"d":"-10.00"}]
["R10",{"$nulls":5},{"$f":"IF(F17*E17=0,\"\",VLOOKUP(E17,Lists!B$10:G$14,CEILING(F17-0.5,1)+1,TRUE))","v":""},{"$nulls":6},{"$f":"IF(M17*L17=0,\"\",VLOOKUP(L17,Lists!B$10:G$14,CEILING(M17-0.5,1)+1,TRUE))","v":""},{"$nulls":10},{"v":-10,"d":"-10.00"},{"v":-10,"d":"-10.00"},{"v":-10,"d":"-10.00"},{"v":-10,"d":"-10.00"}]
["R11",{"$nulls":5},{"$f":"IF(F18*E18=0,\"\",VLOOKUP(E18,Lists!B$10:G$14,CEILING(F18-0.5,1)+1,TRUE))","v":""},{"$nulls":6},{"$f":"IF(M18*L18=0,\"\",VLOOKUP(L18,Lists!B$10:G$14,CEILING(M18-0.5,1)+1,TRUE))","v":""},{"$nulls":10},{"v":-10,"d":"-10.00"},{"v":-10,"d":"-10.00"},{"v":-10,"d":"-10.00"},{"v":-10,"d":"-10.00"}]
["R12",{"$nulls":5},{"$f":"IF(F19*E19=0,\"\",VLOOKUP(E19,Lists!B$10:G$14,CEILING(F19-0.5,1)+1,TRUE))","v":""},{"$nulls":6},{"$f":"IF(M19*L19=0,\"\",VLOOKUP(L19,Lists!B$10:G$14,CEILING(M19-0.5,1)+1,TRUE))","v":""},{"$nulls":10},{"v":-10,"d":"-10.00"},{"v":-10,"d":"-10.00"},{"v":-10,"d":"-10.00"},{"v":-10,"d":"-10.00"}]
["R13",{"$nulls":5},{"$f":"IF(F20*E20=0,\"\",VLOOKUP(E20,Lists!B$10:G$14,CEILING(F20-0.5,1)+1,TRUE))","v":""},{"$nulls":6},{"$f":"IF(M20*L20=0,\"\",VLOOKUP(L20,Lists!B$10:G$14,CEILING(M20-0.5,1)+1,TRUE))","v":""},{"$nulls":10},{"v":-10,"d":"-10.00"},{"v":-10,"d":"-10.00"},{"v":-10,"d":"-10.00"},{"v":-10,"d":"-10.00"}]
["R14",{"$nulls":5},{"$f":"IF(F21*E21=0,\"\",VLOOKUP(E21,Lists!B$10:G$14,CEILING(F21-0.5,1)+1,TRUE))","v":""},{"$nulls":6},{"$f":"IF(M21*L21=0,\"\",VLOOKUP(L21,Lists!B$10:G$14,CEILING(M21-0.5,1)+1,TRUE))","v":""},{"$nulls":10},{"v":-10,"d":"-10.00"},{"v":-10,"d":"-10.00"},{"v":-10,"d":"-10.00"},{"v":-10,"d":"-10.00"}]
["R15",{"$nulls":5},{"$f":"IF(F22*E22=0,\"\",VLOOKUP(E22,Lists!B$10:G$14,CEILING(F22-0.5,1)+1,TRUE))","v":""},{"$nulls":6},{"$f":"IF(M22*L22=0,\"\",VLOOKUP(L22,Lists!B$10:G$14,CEILING(M22-0.5,1)+1,TRUE))","v":""},{"$nulls":10},{"v":-10,"d":"-10.00"},{"v":-10,"d":"-10.00"},{"v":-10,"d":"-10.00"},{"v":-10,"d":"-10.00"}]
["R16",{"$nulls":5},{"$f":"IF(F23*E23=0,\"\",VLOOKUP(E23,Lists!B$10:G$14,CEILING(F23-0.5,1)+1,TRUE))","v":""},{"$nulls":6},{"$f":"IF(M23*L23=0,\"\",VLOOKUP(L23,Lists!B$10:G$14,CEILING(M23-0.5,1)+1,TRUE))","v":""},{"$nulls":10},{"v":-10,"d":"-10.00"},{"v":-10,"d":"-10.00"},{"v":-10,"d":"-10.00"},{"v":-10,"d":"-10.00"}]
["R17",{"$nulls":5},{"$f":"IF(F24*E24=0,\"\",VLOOKUP(E24,Lists!B$10:G$14,CEILING(F24-0.5,1)+1,TRUE))","v":""},{"$nulls":6},{"$f":"IF(M24*L24=0,\"\",VLOOKUP(L24,Lists!B$10:G$14,CEILING(M24-0.5,1)+1,TRUE))","v":""},{"$nulls":10},{"v":-10,"d":"-10.00"},{"v":-10,"d":"-10.00"},{"v":-10,"d":"-10.00"},{"v":-10,"d":"-10.00"}]
["R18",{"$nulls":5},{"$f":"IF(F25*E25=0,\"\",VLOOKUP(E25,Lists!B$10:G$14,CEILING(F25-0.5,1)+1,TRUE))","v":""},{"$nulls":6},{"$f":"IF(M25*L25=0,\"\",VLOOKUP(L25,Lists!B$10:G$14,CEILING(M25-0.5,1)+1,TRUE))","v":""},{"$nulls":10},{"v":-10,"d":"-10.00"},{"v":-10,"d":"-10.00"},{"v":-10,"d":"-10.00"},{"v":-10,"d":"-10.00"}]
["R19",{"$nulls":5},{"$f":"IF(F26*E26=0,\"\",VLOOKUP(E26,Lists!B$10:G$14,CEILING(F26-0.5,1)+1,TRUE))","v":""},{"$nulls":6},{"$f":"IF(M26*L26=0,\"\",VLOOKUP(L26,Lists!B$10:G$14,CEILING(M26-0.5,1)+1,TRUE))","v":""},{"$nulls":10},{"v":-10,"d":"-10.00"},{"v":-10,"d":"-10.00"},{"v":-10,"d":"-10.00"},{"v":-10,"d":"-10.00"}]
["R20",{"$nulls":5},{"$f":"IF(F27*E27=0,\"\",VLOOKUP(E27,Lists!B$10:G$14,CEILING(F27-0.5,1)+1,TRUE))","v":""},{"$nulls":6},{"$f":"IF(M27*L27=0,\"\",VLOOKUP(L27,Lists!B$10:G$14,CEILING(M27-0.5,1)+1,TRUE))","v":""},{"$nulls":10},{"v":-10,"d":"-10.00"},{"v":-10,"d":"-10.00"},{"v":-10,"d":"-10.00"},{"v":-10,"d":"-10.00"}]
[{"$nulls":28},"X-forskyv","Y-forskyv"]
[{"$nulls":28},-0.85,-0.5]
[{"$nulls":24},"X-Konsekvens","Y-Sannsynlighet",null,null,-0.85,-0.25]
[{"$f":"A3","v":"Mål / krav nr 10:"},{"$nulls":22},"Gj sn",{"$f":"IF(F6=\"\",-10,F6-0.5)","v":{"v":-10,"d":"-10.00"}},{"$f":"IF(E6=\"\",-10,E6-0.5)","v":{"v":-10,"d":"-10.00"}},null,null,-0.85,-0.75]
[{"$f":"IF(A4=\"\",\"\",A4)","v":""},{"$nulls":23},{"$f":"IF(M6=\"\",Y31,M6-0.6)","v":{"v":-10,"d":"-10.00"}},{"$f":"IF(L6=\"\",Z31,L6-0.6)","v":{"v":-10,"d":"-10.00"}},null,null,-0.75,-0.5]
[{"$nulls":23},{"$f":"A8","v":"R1"},{"$f":"Y8","v":{"v":-10,"d":"-10.00"}},{"$f":"Z8","v":-10},null,null,-0.75,-0.25]
[null,null,"Når risikovurdering før og etter tiltak er utfylt er:",{"$nulls":21},{"$f":"AA8","v":{"v":-10,"d":"-10.00"}},{"$f":"AB8","v":-10},null,null,-0.75,-0.75]
[null,null,"● = Risikonivå før tiltak",{"$nulls":20},{"$f":"A9","v":"R2"},{"$f":"Y9","v":-10},{"$f":"Z9","v":-10},null,null,-0.66,-0.5]
[null,null,"■ = Risikonivå etter tiltak",{"$nulls":21},{"$f":"AA9","v":{"v":-10,"d":"-10.00"}},{"$f":"AB9","v":-10},null,null,-0.66,-0.25]
[{"$nulls":23},{"$f":"A10","v":"R3"},{"$f":"Y10","v":-10},{"$f":"Z10","v":-10},null,null,-0.66,-0.75]
[{"$nulls":24},{"$f":"AA10","v":-10},{"$f":"AB10","v":-10},null,null,-0.5,-0.5]
[{"$nulls":23},{"$f":"A11","v":"R4"},{"$f":"Y11","v":-10},{"$f":"Z11","v":-10},null,null,-0.5,-0.25]
[{"$nulls":24},{"$f":"AA11","v":-10},{"$f":"AB11","v":-10},null,null,-0.5,-0.75]
[{"$nulls":23},{"$f":"A12","v":"R5"},{"$f":"Y12","v":-10},{"$f":"Z12","v":-10},null,null,-0.33,-0.5]
[{"$nulls":24},{"$f":"AA12","v":-10},{"$f":"AB12","v":-10},null,null,-0.33,-0.25]
[{"$nulls":23},{"$f":"A13","v":"R6"},{"$f":"Y13","v":-10},{"$f":"Z13","v":-10},null,null,-0.33,-0.75]
[{"$nulls":24},{"$f":"AA13","v":-10},{"$f":"AB13","v":-10},null,null,-0.25,-0.5]
[{"$nulls":23},{"$f":"A14","v":"R7"},{"$f":"Y14","v":-10},{"$f":"Z14","v":-10},null,null,-0.25,-0.25]
[{"$nulls":24},{"$f":"AA14","v":-10},{"$f":"AB14","v":-10},null,null,-0.25,-0.75]
[{"$nulls":23},{"$f":"A15","v":"R8"},{"$f":"Y15","v":-10},{"$f":"Z15","v":-10},null,null,-0.15,-0.5]
[{"$nulls":24},{"$f":"AA15","v":-10},{"$f":"AB15","v":-10},null,null,-0.15,-0.25]
[{"$nulls":23},{"$f":"A16","v":"R9"},{"$f":"Y16","v":-10},{"$f":"Z16","v":-10}]
[{"$nulls":24},{"$f":"AA16","v":-10},{"$f":"AB16","v":-10}]
[{"$nulls":23},{"$f":"A17","v":"R10"},{"$f":"Y17","v":-10},{"$f":"Z17","v":-10}]
[{"$nulls":24},{"$f":"AA17","v":-10},{"$f":"AB17","v":-10}]
[{"$nulls":23},{"$f":"A18","v":"R11"},{"$f":"Y18","v":-10},{"$f":"Z18","v":-10}]
[{"$nulls":24},{"$f":"AA18","v":-10},{"$f":"AB18","v":-10}]
[{"$nulls":23},{"$f":"A19","v":"R12"},{"$f":"Y19","v":{"v":-10,"d":"-10.00"}},{"$f":"Z19","v":-10}]
[{"$nulls":24},{"$f":"AA19","v":-10},{"$f":"AB19","v":-10}]
[{"$nulls":23},{"$f":"A20","v":"R13"},{"$f":"Y20","v":-10},{"$f":"Z20","v":-10}]
[{"$nulls":24},{"$f":"AA20","v":-10},{"$f":"AB20","v":-10}]
[{"$nulls":23},{"$f":"A21","v":"R14"},{"$f":"Y21","v":-10},{"$f":"Z21","v":-10}]
[{"$nulls":24},{"$f":"AA21","v":-10},{"$f":"AB21","v":-10}]
[{"$nulls":23},{"$f":"A22","v":"R15"},{"$f":"Y22","v":-10},{"$f":"Z22","v":-10}]
[{"$nulls":24},{"$f":"AA22","v":-10},{"$f":"AB22","v":-10}]
[{"$nulls":23},{"$f":"A23","v":"R16"},{"$f":"Y23","v":{"v":-10,"d":"-10.00"}},{"$f":"Z23","v":{"v":-10,"d":"-10.00"}}]
[{"$nulls":24},{"$f":"AA23","v":{"v":-10,"d":"-10.00"}},{"$f":"AB23","v":{"v":-10,"d":"-10.00"}}]
[{"$nulls":23},{"$f":"A24","v":"R17"},{"$f":"Y24","v":{"v":-10,"d":"-10.00"}},{"$f":"Z24","v":{"v":-10,"d":"-10.00"}}]
[{"$nulls":24},{"$f":"AA24","v":{"v":-10,"d":"-10.00"}},{"$f":"AB24","v":{"v":-10,"d":"-10.00"}}]
[{"$nulls":23},{"$f":"A25","v":"R18"},{"$f":"Y25","v":{"v":-10,"d":"-10.00"}},{"$f":"Z25","v":{"v":-10,"d":"-10.00"}}]
[{"$nulls":24},{"$f":"AA25","v":{"v":-10,"d":"-10.00"}},{"$f":"AB25","v":{"v":-10,"d":"-10.00"}}]
[{"$nulls":23},{"$f":"A26","v":"R19"},{"$f":"Y26","v":{"v":-10,"d":"-10.00"}},{"$f":"Z26","v":{"v":-10,"d":"-10.00"}}]
[{"$nulls":24},{"$f":"AA26","v":{"v":-10,"d":"-10.00"}},{"$f":"AB26","v":{"v":-10,"d":"-10.00"}}]
[{"$nulls":23},{"$f":"A27","v":"R20"},{"$f":"Y27","v":{"v":-10,"d":"-10.00"}},{"$f":"Z27","v":{"v":-10,"d":"-10.00"}}]
[{"$nulls":24},{"$f":"AA27","v":{"v":-10,"d":"-10.00"}},{"$f":"AB27","v":{"v":-10,"d":"-10.00"}}]

{"sheet":"Mål 11","index":18,"n_rows":72,"n_cols":30,"rows_kept":72,"merged":[[0,0,0,3],[0,4,0,6],[0,7,0,8],[0,11,0,13],[1,2,1,3],[1,5,1,6],[1,12,1,13],[2,0,2,2],[2,4,2,6],[2,7,2,8],[2,11,2,13],[3,0,4,3],[3,4,3,5],[3,7,4,10],[3,11,3,12],[5,24,5,25],[5,26,5,27],[30,0,30,2],[31,0,32,3],[34,2,34,3],[35,2,35,3]]}
["Risikoidentifikasjon og analyse",{"$nulls":3},"Ansvarlig:",{"$nulls":6},"Risikomatrise, \nse under"]
["Enhet:",null,{"$f":"IF(Forside!C2=\"\",\"\",Forside!C2)","v":"Tjenesteområde <<tjenesteområde>>"},null,"Dato:",{"$f":"IF(Forside!C4=\"\",\"\",Forside!C4)","v":""}]
["Mål / krav nr 11:",{"$nulls":3},"Risiko før tiltak",null,null,"Deltakere i prosessen:",{"$nulls":3},"Risiko etter tiltak"]
[{"$nulls":4},"Risiko-vurdering",null,"Risiko-nivå",{"$f":"IF(Forside!C3=\"\",\"\",Forside!C3)","v":"<<deltakere>>"},{"$nulls":3},"Risiko-vurdering",null,"Risiko-nivå"]
[{"$nulls":4},"S","K",{"$nulls":5},"S","K"]
[{"$nulls":3},"Gjsn risiko for målet:",{"$f":"IF(ISERROR(AVERAGE(E8:E27)),\"\",ROUND(AVERAGE(E8:E27),0))","v":""},{"$f":"IF(ISERROR(AVERAGE(F8:F27)),\"\",ROUND(AVERAGE(F8:F27),0))","v":""},{"$f":"IF(ISERROR(E6*F6),\"\",VLOOKUP(E6,Lists!B$10:G$14,CEILING(F6-0.5,1)+1,TRUE))","v":""},{"$nulls":4},{"$f":"IF(ISERROR(AVERAGE(L8:L27)),\"\",ROUND(AVERAGE(L8:L27),0))","v":""},{"$f":"IF(ISERROR(AVERAGE(M8:M27)),\"\",ROUND(AVERAGE(M8:M27),0))","v":""},{"$f":"IF(ISERROR(L6*M6),\"\",VLOOKUP(L6,Lists!B$10:G$14,CEILING(M6-0.5,1)+1,TRUE))","v":""},{"$nulls":10},"Før tiltak",null,"Etter tiltak"]
["Risiko nr","Mulige hendelser/ risiko","Område","Eksisterende tiltak","S","K","Risiko-nivå","Risikoeier:","Nye tiltak:","Ansvarlig:","Frist:","S","K","Risiko-nivå",{"$nulls":10},"X-forskyv konsekv","Y-forskyv Sanns","X-forskyv konsekv","Y-forskyv Sanns"]
["R1",{"$nulls":5},{"$f":"IF(F8*E8=0,\"\",VLOOKUP(E8,Lists!B$10:G$14,CEILING(F8-0.5,1)+1,TRUE))","v":""},{"$nulls":6},{"$f":"IF(M8*L8=0,\"\",VLOOKUP(L8,Lists!B$10:G$14,CEILING(M8-0.5,1)+1,TRUE))","v":""},{"$nulls":10},{"$f":"IF(F8=\"\",-10,F8+AC29)","v":{"v":-10,"d":"-10.00"}},{"$f":"IF(E8=\"\",-10,E8+AD29)","v":{"v":-10,"d":"-10.00"}},{"$f":"IF(M8=\"\",Y8,M8+AC29)","v":{"v":-10,"d":"-10.00"}},{"$f":"IF(L8=\"\",Z8,L8+AD29)","v":{"v":-10,"d":"-10.00"}}]
["R2",{"$nulls":5},{"$f":"IF(F9*E9=0,\"\",VLOOKUP(E9,Lists!B$10:G$14,CEILING(F9-0.5,1)+1,TRUE))","v":""},{"$nulls":6},{"$f":"IF(M9*L9=0,\"\",VLOOKUP(L9,Lists!B$10:G$14,CEILING(M9-0.5,1)+1,TRUE))","v":""},{"$nulls":10},{"v":-10,"d":"-10.00"},{"v":-10,"d":"-10.00"},{"v":-10,"d":"-10.00"},{"v":-10,"d":"-10.00"}]
["R3",{"$nulls":5},{"$f":"IF(F10*E10=0,\"\",VLOOKUP(E10,Lists!B$10:G$14,CEILING(F10-0.5,1)+1,TRUE))","v":""},{"$nulls":6},{"$f":"IF(M10*L10=0,\"\",VLOOKUP(L10,Lists!B$10:G$14,CEILING(M10-0.5,1)+1,TRUE))","v":""},{"$nulls":10},{"v":-10,"d":"-10.00"},{"v":-10,"d":"-10.00"},{"v":-10,"d":"-10.00"},{"v":-10,"d":"-10.00"}]
["R4",{"$nulls":5},{"$f":"IF(F11*E11=0,\"\",VLOOKUP(E11,Lists!B$10:G$14,CEILING(F11-0.5,1)+1,TRUE))","v":""},{"$nulls":6},{"$f":"IF(M11*L11=0,\"\",VLOOKUP(L11,Lists!B$10:G$14,CEILING(M11-0.5,1)+1,TRUE))","v":""},{"$nulls":10},{"v":-10,"d":"-10.00"},{"v":-10,"d":"-10.00"},{"v":-10,"d":"-10.00"},{"v":-10,"d":"-10.00"}]
["R5",{"$nulls":5},{"$f":"IF(F12*E12=0,\"\",VLOOKUP(E12,Lists!B$10:G$14,CEILING(F12-0.5,1)+1,TRUE))","v":""},{"$nulls":6},{"$f":"IF(M12*L12=0,\"\",VLOOKUP(L12,Lists!B$10:G$14,CEILING(M12-0.5,1)+1,TRUE))","v":""},{"$nulls":10},{"v":-10,"d":"-10.00"},{"v":-10,"d":"-10.00"},{"v":-10,"d":"-10.00"},{"v":-10,"d":"-10.00"}]
["R6",{"$nulls":5},{"$f":"IF(F13*E13=0,\"\",VLOOKUP(E13,Lists!B$10:G$14,CEILING(F13-0.5,1)+1,TRUE))","v":""},{"$nulls":6},{"$f":"IF(M13*L13=0,\"\",VLOOKUP(L13,Lists!B$10:G$14,CEILING(M13-0.5,1)+1,TRUE))","v":""},{"$nulls":10},{"v":-10,"d":"-10.00"},{"v":-10,"d":"-10.00"},{"v":-10,"d":"-10.00"},{"v":-10,"d":"-10.00"}]
["R7",{"$nulls":5},{"$f":"IF(F14*E14=0,\"\",VLOOKUP(E14,Lists!B$10:G$14,CEILING(F14-0.5,1)+1,TRUE))","v":""},{"$nulls":6},{"$f":"IF(M14*L14=0,\"\",VLOOKUP(L14,Lists!B$10:G$14,CEILING(M14-0.5,1)+1,TRUE))","v":""},{"$nulls":10},{"v":-10,"d":"-10.00"},{"v":-10,"d":"-10.00"},{"v":-10,"d":"-10.00"},{"v":-10,"d":"-10.00"}]
["R8",{"$nulls":5},{"$f":"IF(F15*E15=0,\"\",VLOOKUP(E15,Lists!B$10:G$14,CEILING(F15-0.5,1)+1,TRUE))","v":""},{"$nulls":6},{"$f":"IF(M15*L15=0,\"\",VLOOKUP(L15,Lists!B$10:G$14,CEILING(M15-0.5,1)+1,TRUE))","v":""},{"$nulls":10},{"v":-10,"d":"-10.00"},{"v":-10,"d":"-10.00"},{"v":-10,"d":"-10.00"},{"v":-10,"d":"-10.00"}]
["R9",{"$nulls":5},{"$f":"IF(F16*E16=0,\"\",VLOOKUP(E16,Lists!B$10:G$14,CEILING(F16-0.5,1)+1,TRUE))","v":""},{"$nulls":6},{"$f":"IF(M16*L16=0,\"\",VLOOKUP(L16,Lists!B$10:G$14,CEILING(M16-0.5,1)+1,TRUE))","v":""},{"$nulls":10},{"v":-10,"d":"-10.00"},{"v":-10,"d":"-10.00"},{"v":-10,"d":"-10.00"},{"v":-10,"d":"-10.00"}]
["R10",{"$nulls":5},{"$f":"IF(F17*E17=0,\"\",VLOOKUP(E17,Lists!B$10:G$14,CEILING(F17-0.5,1)+1,TRUE))","v":""},{"$nulls":6},{"$f":"IF(M17*L17=0,\"\",VLOOKUP(L17,Lists!B$10:G$14,CEILING(M17-0.5,1)+1,TRUE))","v":""},{"$nulls":10},{"v":-10,"d":"-10.00"},{"v":-10,"d":"-10.00"},{"v":-10,"d":"-10.00"},{"v":-10,"d":"-10.00"}]
["R11",{"$nulls":5},{"$f":"IF(F18*E18=0,\"\",VLOOKUP(E18,Lists!B$10:G$14,CEILING(F18-0.5,1)+1,TRUE))","v":""},{"$nulls":6},{"$f":"IF(M18*L18=0,\"\",VLOOKUP(L18,Lists!B$10:G$14,CEILING(M18-0.5,1)+1,TRUE))","v":""},{"$nulls":10},{"v":-10,"d":"-10.00"},{"v":-10,"d":"-10.00"},{"v":-10,"d":"-10.00"},{"v":-10,"d":"-10.00"}]
["R12",{"$nulls":5},{"$f":"IF(F19*E19=0,\"\",VLOOKUP(E19,Lists!B$10:G$14,CEILING(F19-0.5,1)+1,TRUE))","v":""},{"$nulls":6},{"$f":"IF(M19*L19=0,\"\",VLOOKUP(L19,Lists!B$10:G$14,CEILING(M19-0.5,1)+1,TRUE))","v":""},{"$nulls":10},{"v":-10,"d":"-10.00"},{"v":-10,"d":"-10.00"},{"v":-10,"d":"-10.00"},{"v":-10,"d":"-10.00"}]
["R13",{"$nulls":5},{"$f":"IF(F20*E20=0,\"\",VLOOKUP(E20,Lists!B$10:G$14,CEILING(F20-0.5,1)+1,TRUE))","v":""},{"$nulls":6},{"$f":"IF(M20*L20=0,\"\",VLOOKUP(L20,Lists!B$10:G$14,CEILING(M20-0.5,1)+1,TRUE))","v":""},{"$nulls":10},{"v":-10,"d":"-10.00"},{"v":-10,"d":"-10.00"},{"v":-10,"d":"-10.00"},{"v":-10,"d":"-10.00"}]
["R14",{"$nulls":5},{"$f":"IF(F21*E21=0,\"\",VLOOKUP(E21,Lists!B$10:G$14,CEILING(F21-0.5,1)+1,TRUE))","v":""},{"$nulls":6},{"$f":"IF(M21*L21=0,\"\",VLOOKUP(L21,Lists!B$10:G$14,CEILING(M21-0.5,1)+1,TRUE))","v":""},{"$nulls":10},{"v":-10,"d":"-10.00"},{"v":-10,"d":"-10.00"},{"v":-10,"d":"-10.00"},{"v":-10,"d":"-10.00"}]
["R15",{"$nulls":5},{"$f":"IF(F22*E22=0,\"\",VLOOKUP(E22,Lists!B$10:G$14,CEILING(F22-0.5,1)+1,TRUE))","v":""},{"$nulls":6},{"$f":"IF(M22*L22=0,\"\",VLOOKUP(L22,Lists!B$10:G$14,CEILING(M22-0.5,1)+1,TRUE))","v":""},{"$nulls":10},{"v":-10,"d":"-10.00"},{"v":-10,"d":"-10.00"},{"v":-10,"d":"-10.00"},{"v":-10,"d":"-10.00"}]
["R16",{"$nulls":5},{"$f":"IF(F23*E23=0,\"\",VLOOKUP(E23,Lists!B$10:G$14,CEILING(F23-0.5,1)+1,TRUE))","v":""},{"$nulls":6},{"$f":"IF(M23*L23=0,\"\",VLOOKUP(L23,Lists!B$10:G$14,CEILING(M23-0.5,1)+1,TRUE))","v":""},{"$nulls":10},{"v":-10,"d":"-10.00"},{"v":-10,"d":"-10.00"},{"v":-10,"d":"-10.00"},{"v":-10,"d":"-10.00"}]
["R17",{"$nulls":5},{"$f":"IF(F24*E24=0,\"\",VLOOKUP(E24,Lists!B$10:G$14,CEILING(F24-0.5,1)+1,TRUE))","v":""},{"$nulls":6},{"$f":"IF(M24*L24=0,\"\",VLOOKUP(L24,Lists!B$10:G$14,CEILING(M24-0.5,1)+1,TRUE))","v":""},{"$nulls":10},{"v":-10,"d":"-10.00"},{"v":-10,"d":"-10.00"},{"v":-10,"d":"-10.00"},{"v":-10,"d":"-10.00"}]
["R18",{"$nulls":5},{"$f":"IF(F25*E25=0,\"\",VLOOKUP(E25,Lists!B$10:G$14,CEILING(F25-0.5,1)+1,TRUE))","v":""},{"$nulls":6},{"$f":"IF(M25*L25=0,\"\",VLOOKUP(L25,Lists!B$10:G$14,CEILING(M25-0.5,1)+1,TRUE))","v":""},{"$nulls":10},{"v":-10,"d":"-10.00"},{"v":-10,"d":"-10.00"},{"v":-10,"d":"-10.00"},{"v":-10,"d":"-10.00"}]
["R19",{"$nulls":5},{"$f":"IF(F26*E26=0,\"\",VLOOKUP(E26,Lists!B$10:G$14,CEILING(F26-0.5,1)+1,TRUE))","v":""},{"$nulls":6},{"$f":"IF(M26*L26=0,\"\",VLOOKUP(L26,Lists!B$10:G$14,CEILING(M26-0.5,1)+1,TRUE))","v":""},{"$nulls":10},{"v":-10,"d":"-10.00"},{"v":-10,"d":"-10.00"},{"v":-10,"d":"-10.00"},{"v":-10,"d":"-10.00"}]
["R20",{"$nulls":5},{"$f":"IF(F27*E27=0,\"\",VLOOKUP(E27,Lists!B$10:G$14,CEILING(F27-0.5,1)+1,TRUE))","v":""},{"$nulls":6},{"$f":"IF(M27*L27=0,\"\",VLOOKUP(L27,Lists!B$10:G$14,CEILING(M27-0.5,1)+1,TRUE))","v":""},{"$nulls":10},{"v":-10,"d":"-10.00"},{"v":-10,"d":"-10.00"},{"v":-10,"d":"-10.00"},{"v":-10,"d":"-10.00"}]
[{"$nulls":28},"X-forskyv","Y-forskyv"]
[{"$nulls":28},-0.85,-0.5]
[{"$nulls":24},"X-Konsekvens","Y-Sannsynlighet",null,null,-0.85,-0.25]
[{"$f":"A3","v":"Mål / krav nr 11:"},{"$nulls":22},"Gj sn",{"$f":"IF(F6=\"\",-10,F6-0.5)","v":{"v":-10,"d":"-10.00"}},{"$f":"IF(E6=\"\",-10,E6-0.5)","v":{"v":-10,"d":"-10.00"}},null,null,-0.85,-0.75]
[{"$f":"IF(A4=\"\",\"\",A4)","v":""},{"$nulls":23},{"$f":"IF(M6=\"\",Y31,M6-0.6)","v":{"v":-10,"d":"-10.00"}},{"$f":"IF(L6=\"\",Z31,L6-0.6)","v":{"v":-10,"d":"-10.00"}},null,null,-0.75,-0.5]
[{"$nulls":23},{"$f":"A8","v":"R1"},{"$f":"Y8","v":{"v":-10,"d":"-10.00"}},{"$f":"Z8","v":-10},null,null,-0.75,-0.25]
[null,null,"Når risikovurdering før og etter tiltak er utfylt er:",{"$nulls":21},{"$f":"AA8","v":{"v":-10,"d":"-10.00"}},{"$f":"AB8","v":-10},null,null,-0.75,-0.75]
[null,null,"● = Risikonivå før tiltak",{"$nulls":20},{"$f":"A9","v":"R2"},{"$f":"Y9","v":-10},{"$f":"Z9","v":-10},null,null,-0.66,-0.5]
[null,null,"■ = Risikonivå etter tiltak",{"$nulls":21},{"$f":"AA9","v":{"v":-10,"d":"-10.00"}},{"$f":"AB9","v":-10},null,null,-0.66,-0.25]
[{"$nulls":23},{"$f":"A10","v":"R3"},{"$f":"Y10","v":-10},{"$f":"Z10","v":-10},null,null,-0.66,-0.75]
[{"$nulls":24},{"$f":"AA10","v":-10},{"$f":"AB10","v":-10},null,null,-0.5,-0.5]
[{"$nulls":23},{"$f":"A11","v":"R4"},{"$f":"Y11","v":-10},{"$f":"Z11","v":-10},null,null,-0.5,-0.25]
[{"$nulls":24},{"$f":"AA11","v":-10},{"$f":"AB11","v":-10},null,null,-0.5,-0.75]
[{"$nulls":23},{"$f":"A12","v":"R5"},{"$f":"Y12","v":-10},{"$f":"Z12","v":-10},null,null,-0.33,-0.5]
[{"$nulls":24},{"$f":"AA12","v":-10},{"$f":"AB12","v":-10},null,null,-0.33,-0.25]
[{"$nulls":23},{"$f":"A13","v":"R6"},{"$f":"Y13","v":-10},{"$f":"Z13","v":-10},null,null,-0.33,-0.75]
[{"$nulls":24},{"$f":"AA13","v":-10},{"$f":"AB13","v":-10},null,null,-0.25,-0.5]
[{"$nulls":23},{"$f":"A14","v":"R7"},{"$f":"Y14","v":-10},{"$f":"Z14","v":-10},null,null,-0.25,-0.25]
[{"$nulls":24},{"$f":"AA14","v":-10},{"$f":"AB14","v":-10},null,null,-0.25,-0.75]
[{"$nulls":23},{"$f":"A15","v":"R8"},{"$f":"Y15","v":-10},{"$f":"Z15","v":-10},null,null,-0.15,-0.5]
[{"$nulls":24},{"$f":"AA15","v":-10},{"$f":"AB15","v":-10},null,null,-0.15,-0.25]
[{"$nulls":23},{"$f":"A16","v":"R9"},{"$f":"Y16","v":-10},{"$f":"Z16","v":-10}]
[{"$nulls":24},{"$f":"AA16","v":-10},{"$f":"AB16","v":-10}]
[{"$nulls":23},{"$f":"A17","v":"R10"},{"$f":"Y17","v":-10},{"$f":"Z17","v":-10}]
[{"$nulls":24},{"$f":"AA17","v":-10},{"$f":"AB17","v":-10}]
[{"$nulls":23},{"$f":"A18","v":"R11"},{"$f":"Y18","v":-10},{"$f":"Z18","v":-10}]
[{"$nulls":24},{"$f":"AA18","v":-10},{"$f":"AB18","v":-10}]
[{"$nulls":23},{"$f":"A19","v":"R12"},{"$f":"Y19","v":{"v":-10,"d":"-10.00"}},{"$f":"Z19","v":-10}]
[{"$nulls":24},{"$f":"AA19","v":-10},{"$f":"AB19","v":-10}]
[{"$nulls":23},{"$f":"A20","v":"R13"},{"$f":"Y20","v":-10},{"$f":"Z20","v":-10}]
[{"$nulls":24},{"$f":"AA20","v":-10},{"$f":"AB20","v":-10}]
[{"$nulls":23},{"$f":"A21","v":"R14"},{"$f":"Y21","v":-10},{"$f":"Z21","v":-10}]
[{"$nulls":24},{"$f":"AA21","v":-10},{"$f":"AB21","v":-10}]
[{"$nulls":23},{"$f":"A22","v":"R15"},{"$f":"Y22","v":-10},{"$f":"Z22","v":-10}]
[{"$nulls":24},{"$f":"AA22","v":-10},{"$f":"AB22","v":-10}]
[{"$nulls":23},{"$f":"A23","v":"R16"},{"$f":"Y23","v":{"v":-10,"d":"-10.00"}},{"$f":"Z23","v":{"v":-10,"d":"-10.00"}}]
[{"$nulls":24},{"$f":"AA23","v":{"v":-10,"d":"-10.00"}},{"$f":"AB23","v":{"v":-10,"d":"-10.00"}}]
[{"$nulls":23},{"$f":"A24","v":"R17"},{"$f":"Y24","v":{"v":-10,"d":"-10.00"}},{"$f":"Z24","v":{"v":-10,"d":"-10.00"}}]
[{"$nulls":24},{"$f":"AA24","v":{"v":-10,"d":"-10.00"}},{"$f":"AB24","v":{"v":-10,"d":"-10.00"}}]
[{"$nulls":23},{"$f":"A25","v":"R18"},{"$f":"Y25","v":{"v":-10,"d":"-10.00"}},{"$f":"Z25","v":{"v":-10,"d":"-10.00"}}]
[{"$nulls":24},{"$f":"AA25","v":{"v":-10,"d":"-10.00"}},{"$f":"AB25","v":{"v":-10,"d":"-10.00"}}]
[{"$nulls":23},{"$f":"A26","v":"R19"},{"$f":"Y26","v":{"v":-10,"d":"-10.00"}},{"$f":"Z26","v":{"v":-10,"d":"-10.00"}}]
[{"$nulls":24},{"$f":"AA26","v":{"v":-10,"d":"-10.00"}},{"$f":"AB26","v":{"v":-10,"d":"-10.00"}}]
[{"$nulls":23},{"$f":"A27","v":"R20"},{"$f":"Y27","v":{"v":-10,"d":"-10.00"}},{"$f":"Z27","v":{"v":-10,"d":"-10.00"}}]
[{"$nulls":24},{"$f":"AA27","v":{"v":-10,"d":"-10.00"}},{"$f":"AB27","v":{"v":-10,"d":"-10.00"}}]

{"sheet":"Mål 12","index":19,"n_rows":72,"n_cols":30,"rows_kept":72,"merged":[[0,0,0,3],[0,4,0,6],[0,7,0,8],[0,11,0,13],[1,2,1,3],[1,5,1,6],[1,12,1,13],[2,0,2,2],[2,4,2,6],[2,7,2,8],[2,11,2,13],[3,0,4,3],[3,4,3,5],[3,7,4,10],[3,11,3,12],[5,24,5,25],[5,26,5,27],[30,0,30,2],[31,0,32,3],[34,2,34,3],[35,2,35,3]]}
["Risikoidentifikasjon og analyse",{"$nulls":3},"Ansvarlig:",{"$nulls":6},"Risikomatrise, \nse under"]
["Enhet:",null,{"$f":"IF(Forside!C2=\"\",\"\",Forside!C2)","v":"Tjenesteområde <<tjenesteområde>>"},null,"Dato:",{"$f":"IF(Forside!C4=\"\",\"\",Forside!C4)","v":""}]
["Mål / krav nr 12:",{"$nulls":3},"Risiko før tiltak",null,null,"Deltakere i prosessen:",{"$nulls":3},"Risiko etter tiltak"]
[{"$nulls":4},"Risiko-vurdering",null,"Risiko-nivå",{"$f":"IF(Forside!C3=\"\",\"\",Forside!C3)","v":"<<deltakere>>"},{"$nulls":3},"Risiko-vurdering",null,"Risiko-nivå"]
[{"$nulls":4},"S","K",{"$nulls":5},"S","K"]
[{"$nulls":3},"Gjsn risiko for målet:",{"$f":"IF(ISERROR(AVERAGE(E8:E27)),\"\",ROUND(AVERAGE(E8:E27),0))","v":""},{"$f":"IF(ISERROR(AVERAGE(F8:F27)),\"\",ROUND(AVERAGE(F8:F27),0))","v":""},{"$f":"IF(ISERROR(E6*F6),\"\",VLOOKUP(E6,Lists!B$10:G$14,CEILING(F6-0.5,1)+1,TRUE))","v":""},{"$nulls":4},{"$f":"IF(ISERROR(AVERAGE(L8:L27)),\"\",ROUND(AVERAGE(L8:L27),0))","v":""},{"$f":"IF(ISERROR(AVERAGE(M8:M27)),\"\",ROUND(AVERAGE(M8:M27),0))","v":""},{"$f":"IF(ISERROR(L6*M6),\"\",VLOOKUP(L6,Lists!B$10:G$14,CEILING(M6-0.5,1)+1,TRUE))","v":""},{"$nulls":10},"Før tiltak",null,"Etter tiltak"]
["Risiko nr","Kritiske suksessfaktorer","Område","Eksisterende tiltak","S","K","Risiko-nivå","Risikoeier:","Nye tiltak:","Ansvarlig:","Frist:","S","K","Risiko-nivå",{"$nulls":10},"X-forskyv konsekv","Y-forskyv Sanns","X-forskyv konsekv","Y-forskyv Sanns"]
["R1",{"$nulls":5},{"$f":"IF(F8*E8=0,\"\",VLOOKUP(E8,Lists!B$10:G$14,CEILING(F8-0.5,1)+1,TRUE))","v":""},{"$nulls":6},{"$f":"IF(M8*L8=0,\"\",VLOOKUP(L8,Lists!B$10:G$14,CEILING(M8-0.5,1)+1,TRUE))","v":""},{"$nulls":10},{"$f":"IF(F8=\"\",-10,F8+AC29)","v":{"v":-10,"d":"-10.00"}},{"$f":"IF(E8=\"\",-10,E8+AD29)","v":{"v":-10,"d":"-10.00"}},{"$f":"IF(M8=\"\",Y8,M8+AC29)","v":{"v":-10,"d":"-10.00"}},{"$f":"IF(L8=\"\",Z8,L8+AD29)","v":{"v":-10,"d":"-10.00"}}]
["R2",{"$nulls":5},{"$f":"IF(F9*E9=0,\"\",VLOOKUP(E9,Lists!B$10:G$14,CEILING(F9-0.5,1)+1,TRUE))","v":""},{"$nulls":6},{"$f":"IF(M9*L9=0,\"\",VLOOKUP(L9,Lists!B$10:G$14,CEILING(M9-0.5,1)+1,TRUE))","v":""},{"$nulls":10},{"v":-10,"d":"-10.00"},{"v":-10,"d":"-10.00"},{"v":-10,"d":"-10.00"},{"v":-10,"d":"-10.00"}]
["R3",{"$nulls":5},{"$f":"IF(F10*E10=0,\"\",VLOOKUP(E10,Lists!B$10:G$14,CEILING(F10-0.5,1)+1,TRUE))","v":""},{"$nulls":6},{"$f":"IF(M10*L10=0,\"\",VLOOKUP(L10,Lists!B$10:G$14,CEILING(M10-0.5,1)+1,TRUE))","v":""},{"$nulls":10},{"v":-10,"d":"-10.00"},{"v":-10,"d":"-10.00"},{"v":-10,"d":"-10.00"},{"v":-10,"d":"-10.00"}]
["R4",{"$nulls":5},{"$f":"IF(F11*E11=0,\"\",VLOOKUP(E11,Lists!B$10:G$14,CEILING(F11-0.5,1)+1,TRUE))","v":""},{"$nulls":6},{"$f":"IF(M11*L11=0,\"\",VLOOKUP(L11,Lists!B$10:G$14,CEILING(M11-0.5,1)+1,TRUE))","v":""},{"$nulls":10},{"v":-10,"d":"-10.00"},{"v":-10,"d":"-10.00"},{"v":-10,"d":"-10.00"},{"v":-10,"d":"-10.00"}]
["R5",{"$nulls":5},{"$f":"IF(F12*E12=0,\"\",VLOOKUP(E12,Lists!B$10:G$14,CEILING(F12-0.5,1)+1,TRUE))","v":""},{"$nulls":6},{"$f":"IF(M12*L12=0,\"\",VLOOKUP(L12,Lists!B$10:G$14,CEILING(M12-0.5,1)+1,TRUE))","v":""},{"$nulls":10},{"v":-10,"d":"-10.00"},{"v":-10,"d":"-10.00"},{"v":-10,"d":"-10.00"},{"v":-10,"d":"-10.00"}]
["R6",{"$nulls":5},{"$f":"IF(F13*E13=0,\"\",VLOOKUP(E13,Lists!B$10:G$14,CEILING(F13-0.5,1)+1,TRUE))","v":""},{"$nulls":6},{"$f":"IF(M13*L13=0,\"\",VLOOKUP(L13,Lists!B$10:G$14,CEILING(M13-0.5,1)+1,TRUE))","v":""},{"$nulls":10},{"v":-10,"d":"-10.00"},{"v":-10,"d":"-10.00"},{"v":-10,"d":"-10.00"},{"v":-10,"d":"-10.00"}]
["R7",{"$nulls":5},{"$f":"IF(F14*E14=0,\"\",VLOOKUP(E14,Lists!B$10:G$14,CEILING(F14-0.5,1)+1,TRUE))","v":""},{"$nulls":6},{"$f":"IF(M14*L14=0,\"\",VLOOKUP(L14,Lists!B$10:G$14,CEILING(M14-0.5,1)+1,TRUE))","v":""},{"$nulls":10},{"v":-10,"d":"-10.00"},{"v":-10,"d":"-10.00"},{"v":-10,"d":"-10.00"},{"v":-10,"d":"-10.00"}]
["R8",{"$nulls":5},{"$f":"IF(F15*E15=0,\"\",VLOOKUP(E15,Lists!B$10:G$14,CEILING(F15-0.5,1)+1,TRUE))","v":""},{"$nulls":6},{"$f":"IF(M15*L15=0,\"\",VLOOKUP(L15,Lists!B$10:G$14,CEILING(M15-0.5,1)+1,TRUE))","v":""},{"$nulls":10},{"v":-10,"d":"-10.00"},{"v":-10,"d":"-10.00"},{"v":-10,"d":"-10.00"},{"v":-10,"d":"-10.00"}]
["R9",{"$nulls":5},{"$f":"IF(F16*E16=0,\"\",VLOOKUP(E16,Lists!B$10:G$14,CEILING(F16-0.5,1)+1,TRUE))","v":""},{"$nulls":6},{"$f":"IF(M16*L16=0,\"\",VLOOKUP(L16,Lists!B$10:G$14,CEILING(M16-0.5,1)+1,TRUE))","v":""},{"$nulls":10},{"v":-10,"d":"-10.00"},{"v":-10,"d":"-10.00"},{"v":-10,"d":"-10.00"},{"v":-10,"d":"-10.00"}]
["R10",{"$nulls":5},{"$f":"IF(F17*E17=0,\"\",VLOOKUP(E17,Lists!B$10:G$14,CEILING(F17-0.5,1)+1,TRUE))","v":""},{"$nulls":6},{"$f":"IF(M17*L17=0,\"\",VLOOKUP(L17,Lists!B$10:G$14,CEILING(M17-0.5,1)+1,TRUE))","v":""},{"$nulls":10},{"v":-10,"d":"-10.00"},{"v":-10,"d":"-10.00"},{"v":-10,"d":"-10.00"},{"v":-10,"d":"-10.00"}]
["R11",{"$nulls":5},{"$f":"IF(F18*E18=0,\"\",VLOOKUP(E18,Lists!B$10:G$14,CEILING(F18-0.5,1)+1,TRUE))","v":""},{"$nulls":6},{"$f":"IF(M18*L18=0,\"\",VLOOKUP(L18,Lists!B$10:G$14,CEILING(M18-0.5,1)+1,TRUE))","v":""},{"$nulls":10},{"v":-10,"d":"-10.00"},{"v":-10,"d":"-10.00"},{"v":-10,"d":"-10.00"},{"v":-10,"d":"-10.00"}]
["R12",{"$nulls":5},{"$f":"IF(F19*E19=0,\"\",VLOOKUP(E19,Lists!B$10:G$14,CEILING(F19-0.5,1)+1,TRUE))","v":""},{"$nulls":6},{"$f":"IF(M19*L19=0,\"\",VLOOKUP(L19,Lists!B$10:G$14,CEILING(M19-0.5,1)+1,TRUE))","v":""},{"$nulls":10},{"v":-10,"d":"-10.00"},{"v":-10,"d":"-10.00"},{"v":-10,"d":"-10.00"},{"v":-10,"d":"-10.00"}]
["R13",{"$nulls":5},{"$f":"IF(F20*E20=0,\"\",VLOOKUP(E20,Lists!B$10:G$14,CEILING(F20-0.5,1)+1,TRUE))","v":""},{"$nulls":6},{"$f":"IF(M20*L20=0,\"\",VLOOKUP(L20,Lists!B$10:G$14,CEILING(M20-0.5,1)+1,TRUE))","v":""},{"$nulls":10},{"v":-10,"d":"-10.00"},{"v":-10,"d":"-10.00"},{"v":-10,"d":"-10.00"},{"v":-10,"d":"-10.00"}]
["R14",{"$nulls":5},{"$f":"IF(F21*E21=0,\"\",VLOOKUP(E21,Lists!B$10:G$14,CEILING(F21-0.5,1)+1,TRUE))","v":""},{"$nulls":6},{"$f":"IF(M21*L21=0,\"\",VLOOKUP(L21,Lists!B$10:G$14,CEILING(M21-0.5,1)+1,TRUE))","v":""},{"$nulls":10},{"v":-10,"d":"-10.00"},{"v":-10,"d":"-10.00"},{"v":-10,"d":"-10.00"},{"v":-10,"d":"-10.00"}]
["R15",{"$nulls":5},{"$f":"IF(F22*E22=0,\"\",VLOOKUP(E22,Lists!B$10:G$14,CEILING(F22-0.5,1)+1,TRUE))","v":""},{"$nulls":6},{"$f":"IF(M22*L22=0,\"\",VLOOKUP(L22,Lists!B$10:G$14,CEILING(M22-0.5,1)+1,TRUE))","v":""},{"$nulls":10},{"v":-10,"d":"-10.00"},{"v":-10,"d":"-10.00"},{"v":-10,"d":"-10.00"},{"v":-10,"d":"-10.00"}]
["R16",{"$nulls":5},{"$f":"IF(F23*E23=0,\"\",VLOOKUP(E23,Lists!B$10:G$14,CEILING(F23-0.5,1)+1,TRUE))","v":""},{"$nulls":6},{"$f":"IF(M23*L23=0,\"\",VLOOKUP(L23,Lists!B$10:G$14,CEILING(M23-0.5,1)+1,TRUE))","v":""},{"$nulls":10},{"v":-10,"d":"-10.00"},{"v":-10,"d":"-10.00"},{"v":-10,"d":"-10.00"},{"v":-10,"d":"-10.00"}]
["R17",{"$nulls":5},{"$f":"IF(F24*E24=0,\"\",VLOOKUP(E24,Lists!B$10:G$14,CEILING(F24-0.5,1)+1,TRUE))","v":""},{"$nulls":6},{"$f":"IF(M24*L24=0,\"\",VLOOKUP(L24,Lists!B$10:G$14,CEILING(M24-0.5,1)+1,TRUE))","v":""},{"$nulls":10},{"v":-10,"d":"-10.00"},{"v":-10,"d":"-10.00"},{"v":-10,"d":"-10.00"},{"v":-10,"d":"-10.00"}]
["R18",{"$nulls":5},{"$f":"IF(F25*E25=0,\"\",VLOOKUP(E25,Lists!B$10:G$14,CEILING(F25-0.5,1)+1,TRUE))","v":""},{"$nulls":6},{"$f":"IF(M25*L25=0,\"\",VLOOKUP(L25,Lists!B$10:G$14,CEILING(M25-0.5,1)+1,TRUE))","v":""},{"$nulls":10},{"v":-10,"d":"-10.00"},{"v":-10,"d":"-10.00"},{"v":-10,"d":"-10.00"},{"v":-10,"d":"-10.00"}]
["R19",{"$nulls":5},{"$f":"IF(F26*E26=0,\"\",VLOOKUP(E26,Lists!B$10:G$14,CEILING(F26-0.5,1)+1,TRUE))","v":""},{"$nulls":6},{"$f":"IF(M26*L26=0,\"\",VLOOKUP(L26,Lists!B$10:G$14,CEILING(M26-0.5,1)+1,TRUE))","v":""},{"$nulls":10},{"v":-10,"d":"-10.00"},{"v":-10,"d":"-10.00"},{"v":-10,"d":"-10.00"},{"v":-10,"d":"-10.00"}]
["R20",{"$nulls":5},{"$f":"IF(F27*E27=0,\"\",VLOOKUP(E27,Lists!B$10:G$14,CEILING(F27-0.5,1)+1,TRUE))","v":""},{"$nulls":6},{"$f":"IF(M27*L27=0,\"\",VLOOKUP(L27,Lists!B$10:G$14,CEILING(M27-0.5,1)+1,TRUE))","v":""},{"$nulls":10},{"v":-10,"d":"-10.00"},{"v":-10,"d":"-10.00"},{"v":-10,"d":"-10.00"},{"v":-10,"d":"-10.00"}]
[{"$nulls":28},"X-forskyv","Y-forskyv"]
[{"$nulls":28},-0.85,-0.5]
[{"$nulls":24},"X-Konsekvens","Y-Sannsynlighet",null,null,-0.85,-0.25]
[{"$f":"A3","v":"Mål / krav nr 12:"},{"$nulls":22},"Gj sn",{"$f":"IF(F6=\"\",-10,F6-0.5)","v":{"v":-10,"d":"-10.00"}},{"$f":"IF(E6=\"\",-10,E6-0.5)","v":{"v":-10,"d":"-10.00"}},null,null,-0.85,-0.75]
[{"$f":"IF(A4=\"\",\"\",A4)","v":""},{"$nulls":23},{"$f":"IF(M6=\"\",Y31,M6-0.6)","v":{"v":-10,"d":"-10.00"}},{"$f":"IF(L6=\"\",Z31,L6-0.6)","v":{"v":-10,"d":"-10.00"}},null,null,-0.75,-0.5]
[{"$nulls":23},{"$f":"A8","v":"R1"},{"$f":"Y8","v":{"v":-10,"d":"-10.00"}},{"$f":"Z8","v":-10},null,null,-0.75,-0.25]
[null,null,"Når risikovurdering før og etter tiltak er utfylt er:",{"$nulls":21},{"$f":"AA8","v":{"v":-10,"d":"-10.00"}},{"$f":"AB8","v":-10},null,null,-0.75,-0.75]
[null,null,"● = Risikonivå før tiltak",{"$nulls":20},{"$f":"A9","v":"R2"},{"$f":"Y9","v":-10},{"$f":"Z9","v":-10},null,null,-0.66,-0.5]
[null,null,"■ = Risikonivå etter tiltak",{"$nulls":21},{"$f":"AA9","v":{"v":-10,"d":"-10.00"}},{"$f":"AB9","v":-10},null,null,-0.66,-0.25]
[{"$nulls":23},{"$f":"A10","v":"R3"},{"$f":"Y10","v":-10},{"$f":"Z10","v":-10},null,null,-0.66,-0.75]
[{"$nulls":24},{"$f":"AA10","v":-10},{"$f":"AB10","v":-10},null,null,-0.5,-0.5]
[{"$nulls":23},{"$f":"A11","v":"R4"},{"$f":"Y11","v":-10},{"$f":"Z11","v":-10},null,null,-0.5,-0.25]
[{"$nulls":24},{"$f":"AA11","v":-10},{"$f":"AB11","v":-10},null,null,-0.5,-0.75]
[{"$nulls":23},{"$f":"A12","v":"R5"},{"$f":"Y12","v":-10},{"$f":"Z12","v":-10},null,null,-0.33,-0.5]
[{"$nulls":24},{"$f":"AA12","v":-10},{"$f":"AB12","v":-10},null,null,-0.33,-0.25]
[{"$nulls":23},{"$f":"A13","v":"R6"},{"$f":"Y13","v":-10},{"$f":"Z13","v":-10},null,null,-0.33,-0.75]
[{"$nulls":24},{"$f":"AA13","v":-10},{"$f":"AB13","v":-10},null,null,-0.25,-0.5]
[{"$nulls":23},{"$f":"A14","v":"R7"},{"$f":"Y14","v":-10},{"$f":"Z14","v":-10},null,null,-0.25,-0.25]
[{"$nulls":24},{"$f":"AA14","v":-10},{"$f":"AB14","v":-10},null,null,-0.25,-0.75]
[{"$nulls":23},{"$f":"A15","v":"R8"},{"$f":"Y15","v":-10},{"$f":"Z15","v":-10},null,null,-0.15,-0.5]
[{"$nulls":24},{"$f":"AA15","v":-10},{"$f":"AB15","v":-10},null,null,-0.15,-0.25]
[{"$nulls":23},{"$f":"A16","v":"R9"},{"$f":"Y16","v":-10},{"$f":"Z16","v":-10}]
[{"$nulls":24},{"$f":"AA16","v":-10},{"$f":"AB16","v":-10}]
[{"$nulls":23},{"$f":"A17","v":"R10"},{"$f":"Y17","v":-10},{"$f":"Z17","v":-10}]
[{"$nulls":24},{"$f":"AA17","v":-10},{"$f":"AB17","v":-10}]
[{"$nulls":23},{"$f":"A18","v":"R11"},{"$f":"Y18","v":-10},{"$f":"Z18","v":-10}]
[{"$nulls":24},{"$f":"AA18","v":-10},{"$f":"AB18","v":-10}]
[{"$nulls":23},{"$f":"A19","v":"R12"},{"$f":"Y19","v":{"v":-10,"d":"-10.00"}},{"$f":"Z19","v":-10}]
[{"$nulls":24},{"$f":"AA19","v":-10},{"$f":"AB19","v":-10}]
[{"$nulls":23},{"$f":"A20","v":"R13"},{"$f":"Y20","v":-10},{"$f":"Z20","v":-10}]
[{"$nulls":24},{"$f":"AA20","v":-10},{"$f":"AB20","v":-10}]
[{"$nulls":23},{"$f":"A21","v":"R14"},{"$f":"Y21","v":-10},{"$f":"Z21","v":-10}]
[{"$nulls":24},{"$f":"AA21","v":-10},{"$f":"AB21","v":-10}]
[{"$nulls":23},{"$f":"A22","v":"R15"},{"$f":"Y22","v":-10},{"$f":"Z22","v":-10}]
[{"$nulls":24},{"$f":"AA22","v":-10},{"$f":"AB22","v":-10}]
[{"$nulls":23},{"$f":"A23","v":"R16"},{"$f":"Y23","v":{"v":-10,"d":"-10.00"}},{"$f":"Z23","v":{"v":-10,"d":"-10.00"}}]
[{"$nulls":24},{"$f":"AA23","v":{"v":-10,"d":"-10.00"}},{"$f":"AB23","v":{"v":-10,"d":"-10.00"}}]
[{"$nulls":23},{"$f":"A24","v":"R17"},{"$f":"Y24","v":{"v":-10,"d":"-10.00"}},{"$f":"Z24","v":{"v":-10,"d":"-10.00"}}]
[{"$nulls":24},{"$f":"AA24","v":{"v":-10,"d":"-10.00"}},{"$f":"AB24","v":{"v":-10,"d":"-10.00"}}]
[{"$nulls":23},{"$f":"A25","v":"R18"},{"$f":"Y25","v":{"v":-10,"d":"-10.00"}},{"$f":"Z25","v":{"v":-10,"d":"-10.00"}}]
[{"$nulls":24},{"$f":"AA25","v":{"v":-10,"d":"-10.00"}},{"$f":"AB25","v":{"v":-10,"d":"-10.00"}}]
[{"$nulls":23},{"$f":"A26","v":"R19"},{"$f":"Y26","v":{"v":-10,"d":"-10.00"}},{"$f":"Z26","v":{"v":-10,"d":"-10.00"}}]
[{"$nulls":24},{"$f":"AA26","v":{"v":-10,"d":"-10.00"}},{"$f":"AB26","v":{"v":-10,"d":"-10.00"}}]
[{"$nulls":23},{"$f":"A27","v":"R20"},{"$f":"Y27","v":{"v":-10,"d":"-10.00"}},{"$f":"Z27","v":{"v":-10,"d":"-10.00"}}]
[{"$nulls":24},{"$f":"AA27","v":{"v":-10,"d":"-10.00"}},{"$f":"AB27","v":{"v":-10,"d":"-10.00"}}]

{"sheet":"Mål 13","index":20,"n_rows":72,"n_cols":30,"rows_kept":72,"merged":[[0,0,0,3],[0,4,0,6],[0,7,0,8],[0,11,0,13],[1,2,1,3],[1,5,1,6],[1,12,1,13],[2,0,2,2],[2,4,2,6],[2,7,2,8],[2,11,2,13],[3,0,4,3],[3,4,3,5],[3,7,4,10],[3,11,3,12],[5,24,5,25],[5,26,5,27],[30,0,30,2],[31,0,32,3],[34,2,34,3],[35,2,35,3]]}
["Risikoidentifikasjon og analyse",{"$nulls":3},"Ansvarlig:",{"$nulls":6},"Risikomatrise, \nse under"]
["Enhet:",null,{"$f":"IF(Forside!C2=\"\",\"\",Forside!C2)","v":"Tjenesteområde <<tjenesteområde>>"},null,"Dato:",{"$f":"IF(Forside!C4=\"\",\"\",Forside!C4)","v":""}]
["Mål / krav nr 13:",{"$nulls":3},"Risiko før tiltak",null,null,"Deltakere i prosessen:",{"$nulls":3},"Risiko etter tiltak"]
[{"$nulls":4},"Risiko-vurdering",null,"Risiko-nivå",{"$f":"IF(Forside!C3=\"\",\"\",Forside!C3)","v":"<<deltakere>>"},{"$nulls":3},"Risiko-vurdering",null,"Risiko-nivå"]
[{"$nulls":4},"S","K",{"$nulls":5},"S","K"]
[{"$nulls":3},"Gjsn risiko for målet:",{"$f":"IF(ISERROR(AVERAGE(E8:E27)),\"\",ROUND(AVERAGE(E8:E27),0))","v":""},{"$f":"IF(ISERROR(AVERAGE(F8:F27)),\"\",ROUND(AVERAGE(F8:F27),0))","v":""},{"$f":"IF(ISERROR(E6*F6),\"\",VLOOKUP(E6,Lists!B$10:G$14,CEILING(F6-0.5,1)+1,TRUE))","v":""},{"$nulls":4},{"$f":"IF(ISERROR(AVERAGE(L8:L27)),\"\",ROUND(AVERAGE(L8:L27),0))","v":""},{"$f":"IF(ISERROR(AVERAGE(M8:M27)),\"\",ROUND(AVERAGE(M8:M27),0))","v":""},{"$f":"IF(ISERROR(L6*M6),\"\",VLOOKUP(L6,Lists!B$10:G$14,CEILING(M6-0.5,1)+1,TRUE))","v":""},{"$nulls":10},"Før tiltak",null,"Etter tiltak"]
["Risiko nr","Kritiske suksessfaktorer","Område","Eksisterende tiltak","S","K","Risiko-nivå","Risikoeier:","Nye tiltak:","Ansvarlig:","Frist:","S","K","Risiko-nivå",{"$nulls":10},"X-forskyv konsekv","Y-forskyv Sanns","X-forskyv konsekv","Y-forskyv Sanns"]
["R1",{"$nulls":5},{"$f":"IF(F8*E8=0,\"\",VLOOKUP(E8,Lists!B$10:G$14,CEILING(F8-0.5,1)+1,TRUE))","v":""},{"$nulls":6},{"$f":"IF(M8*L8=0,\"\",VLOOKUP(L8,Lists!B$10:G$14,CEILING(M8-0.5,1)+1,TRUE))","v":""},{"$nulls":10},{"$f":"IF(F8=\"\",-10,F8+AC29)","v":{"v":-10,"d":"-10.00"}},{"$f":"IF(E8=\"\",-10,E8+AD29)","v":{"v":-10,"d":"-10.00"}},{"$f":"IF(M8=\"\",Y8,M8+AC29)","v":{"v":-10,"d":"-10.00"}},{"$f":"IF(L8=\"\",Z8,L8+AD29)","v":{"v":-10,"d":"-10.00"}}]
["R2",{"$nulls":5},{"$f":"IF(F9*E9=0,\"\",VLOOKUP(E9,Lists!B$10:G$14,CEILING(F9-0.5,1)+1,TRUE))","v":""},{"$nulls":6},{"$f":"IF(M9*L9=0,\"\",VLOOKUP(L9,Lists!B$10:G$14,CEILING(M9-0.5,1)+1,TRUE))","v":""},{"$nulls":10},{"v":-10,"d":"-10.00"},{"v":-10,"d":"-10.00"},{"v":-10,"d":"-10.00"},{"v":-10,"d":"-10.00"}]
["R3",{"$nulls":5},{"$f":"IF(F10*E10=0,\"\",VLOOKUP(E10,Lists!B$10:G$14,CEILING(F10-0.5,1)+1,TRUE))","v":""},{"$nulls":6},{"$f":"IF(M10*L10=0,\"\",VLOOKUP(L10,Lists!B$10:G$14,CEILING(M10-0.5,1)+1,TRUE))","v":""},{"$nulls":10},{"v":-10,"d":"-10.00"},{"v":-10,"d":"-10.00"},{"v":-10,"d":"-10.00"},{"v":-10,"d":"-10.00"}]
["R4",{"$nulls":5},{"$f":"IF(F11*E11=0,\"\",VLOOKUP(E11,Lists!B$10:G$14,CEILING(F11-0.5,1)+1,TRUE))","v":""},{"$nulls":6},{"$f":"IF(M11*L11=0,\"\",VLOOKUP(L11,Lists!B$10:G$14,CEILING(M11-0.5,1)+1,TRUE))","v":""},{"$nulls":10},{"v":-10,"d":"-10.00"},{"v":-10,"d":"-10.00"},{"v":-10,"d":"-10.00"},{"v":-10,"d":"-10.00"}]
["R5",{"$nulls":5},{"$f":"IF(F12*E12=0,\"\",VLOOKUP(E12,Lists!B$10:G$14,CEILING(F12-0.5,1)+1,TRUE))","v":""},{"$nulls":6},{"$f":"IF(M12*L12=0,\"\",VLOOKUP(L12,Lists!B$10:G$14,CEILING(M12-0.5,1)+1,TRUE))","v":""},{"$nulls":10},{"v":-10,"d":"-10.00"},{"v":-10,"d":"-10.00"},{"v":-10,"d":"-10.00"},{"v":-10,"d":"-10.00"}]
["R6",{"$nulls":5},{"$f":"IF(F13*E13=0,\"\",VLOOKUP(E13,Lists!B$10:G$14,CEILING(F13-0.5,1)+1,TRUE))","v":""},{"$nulls":6},{"$f":"IF(M13*L13=0,\"\",VLOOKUP(L13,Lists!B$10:G$14,CEILING(M13-0.5,1)+1,TRUE))","v":""},{"$nulls":10},{"v":-10,"d":"-10.00"},{"v":-10,"d":"-10.00"},{"v":-10,"d":"-10.00"},{"v":-10,"d":"-10.00"}]
["R7",{"$nulls":5},{"$f":"IF(F14*E14=0,\"\",VLOOKUP(E14,Lists!B$10:G$14,CEILING(F14-0.5,1)+1,TRUE))","v":""},{"$nulls":6},{"$f":"IF(M14*L14=0,\"\",VLOOKUP(L14,Lists!B$10:G$14,CEILING(M14-0.5,1)+1,TRUE))","v":""},{"$nulls":10},{"v":-10,"d":"-10.00"},{"v":-10,"d":"-10.00"},{"v":-10,"d":"-10.00"},{"v":-10,"d":"-10.00"}]
["R8",{"$nulls":5},{"$f":"IF(F15*E15=0,\"\",VLOOKUP(E15,Lists!B$10:G$14,CEILING(F15-0.5,1)+1,TRUE))","v":""},{"$nulls":6},{"$f":"IF(M15*L15=0,\"\",VLOOKUP(L15,Lists!B$10:G$14,CEILING(M15-0.5,1)+1,TRUE))","v":""},{"$nulls":10},{"v":-10,"d":"-10.00"},{"v":-10,"d":"-10.00"},{"v":-10,"d":"-10.00"},{"v":-10,"d":"-10.00"}]
["R9",{"$nulls":5},{"$f":"IF(F16*E16=0,\"\",VLOOKUP(E16,Lists!B$10:G$14,CEILING(F16-0.5,1)+1,TRUE))","v":""},{"$nulls":6},{"$f":"IF(M16*L16=0,\"\",VLOOKUP(L16,Lists!B$10:G$14,CEILING(M16-0.5,1)+1,TRUE))","v":""},{"$nulls":10},{"v":-10,"d":"-10.00"},{"v":-10,"d":"-10.00"},{"v":-10,"d":"-10.00"},{"v":-10,"d":"-10.00"}]
["R10",{"$nulls":5},{"$f":"IF(F17*E17=0,\"\",VLOOKUP(E17,Lists!B$10:G$14,CEILING(F17-0.5,1)+1,TRUE))","v":""},{"$nulls":6},{"$f":"IF(M17*L17=0,\"\",VLOOKUP(L17,Lists!B$10:G$14,CEILING(M17-0.5,1)+1,TRUE))","v":""},{"$nulls":10},{"v":-10,"d":"-10.00"},{"v":-10,"d":"-10.00"},{"v":-10,"d":"-10.00"},{"v":-10,"d":"-10.00"}]
["R11",{"$nulls":5},{"$f":"IF(F18*E18=0,\"\",VLOOKUP(E18,Lists!B$10:G$14,CEILING(F18-0.5,1)+1,TRUE))","v":""},{"$nulls":6},{"$f":"IF(M18*L18=0,\"\",VLOOKUP(L18,Lists!B$10:G$14,CEILING(M18-0.5,1)+1,TRUE))","v":""},{"$nulls":10},{"v":-10,"d":"-10.00"},{"v":-10,"d":"-10.00"},{"v":-10,"d":"-10.00"},{"v":-10,"d":"-10.00"}]
["R12",{"$nulls":5},{"$f":"IF(F19*E19=0,\"\",VLOOKUP(E19,Lists!B$10:G$14,CEILING(F19-0.5,1)+1,TRUE))","v":""},{"$nulls":6},{"$f":"IF(M19*L19=0,\"\",VLOOKUP(L19,Lists!B$10:G$14,CEILING(M19-0.5,1)+1,TRUE))","v":""},{"$nulls":10},{"v":-10,"d":"-10.00"},{"v":-10,"d":"-10.00"},{"v":-10,"d":"-10.00"},{"v":-10,"d":"-10.00"}]
["R13",{"$nulls":5},{"$f":"IF(F20*E20=0,\"\",VLOOKUP(E20,Lists!B$10:G$14,CEILING(F20-0.5,1)+1,TRUE))","v":""},{"$nulls":6},{"$f":"IF(M20*L20=0,\"\",VLOOKUP(L20,Lists!B$10:G$14,CEILING(M20-0.5,1)+1,TRUE))","v":""},{"$nulls":10},{"v":-10,"d":"-10.00"},{"v":-10,"d":"-10.00"},{"v":-10,"d":"-10.00"},{"v":-10,"d":"-10.00"}]
["R14",{"$nulls":5},{"$f":"IF(F21*E21=0,\"\",VLOOKUP(E21,Lists!B$10:G$14,CEILING(F21-0.5,1)+1,TRUE))","v":""},{"$nulls":6},{"$f":"IF(M21*L21=0,\"\",VLOOKUP(L21,Lists!B$10:G$14,CEILING(M21-0.5,1)+1,TRUE))","v":""},{"$nulls":10},{"v":-10,"d":"-10.00"},{"v":-10,"d":"-10.00"},{"v":-10,"d":"-10.00"},{"v":-10,"d":"-10.00"}]
["R15",{"$nulls":5},{"$f":"IF(F22*E22=0,\"\",VLOOKUP(E22,Lists!B$10:G$14,CEILING(F22-0.5,1)+1,TRUE))","v":""},{"$nulls":6},{"$f":"IF(M22*L22=0,\"\",VLOOKUP(L22,Lists!B$10:G$14,CEILING(M22-0.5,1)+1,TRUE))","v":""},{"$nulls":10},{"v":-10,"d":"-10.00"},{"v":-10,"d":"-10.00"},{"v":-10,"d":"-10.00"},{"v":-10,"d":"-10.00"}]
["R16",{"$nulls":5},{"$f":"IF(F23*E23=0,\"\",VLOOKUP(E23,Lists!B$10:G$14,CEILING(F23-0.5,1)+1,TRUE))","v":""},{"$nulls":6},{"$f":"IF(M23*L23=0,\"\",VLOOKUP(L23,Lists!B$10:G$14,CEILING(M23-0.5,1)+1,TRUE))","v":""},{"$nulls":10},{"v":-10,"d":"-10.00"},{"v":-10,"d":"-10.00"},{"v":-10,"d":"-10.00"},{"v":-10,"d":"-10.00"}]
["R17",{"$nulls":5},{"$f":"IF(F24*E24=0,\"\",VLOOKUP(E24,Lists!B$10:G$14,CEILING(F24-0.5,1)+1,TRUE))","v":""},{"$nulls":6},{"$f":"IF(M24*L24=0,\"\",VLOOKUP(L24,Lists!B$10:G$14,CEILING(M24-0.5,1)+1,TRUE))","v":""},{"$nulls":10},{"v":-10,"d":"-10.00"},{"v":-10,"d":"-10.00"},{"v":-10,"d":"-10.00"},{"v":-10,"d":"-10.00"}]
["R18",{"$nulls":5},{"$f":"IF(F25*E25=0,\"\",VLOOKUP(E25,Lists!B$10:G$14,CEILING(F25-0.5,1)+1,TRUE))","v":""},{"$nulls":6},{"$f":"IF(M25*L25=0,\"\",VLOOKUP(L25,Lists!B$10:G$14,CEILING(M25-0.5,1)+1,TRUE))","v":""},{"$nulls":10},{"v":-10,"d":"-10.00"},{"v":-10,"d":"-10.00"},{"v":-10,"d":"-10.00"},{"v":-10,"d":"-10.00"}]
["R19",{"$nulls":5},{"$f":"IF(F26*E26=0,\"\",VLOOKUP(E26,Lists!B$10:G$14,CEILING(F26-0.5,1)+1,TRUE))","v":""},{"$nulls":6},{"$f":"IF(M26*L26=0,\"\",VLOOKUP(L26,Lists!B$10:G$14,CEILING(M26-0.5,1)+1,TRUE))","v":""},{"$nulls":10},{"v":-10,"d":"-10.00"},{"v":-10,"d":"-10.00"},{"v":-10,"d":"-10.00"},{"v":-10,"d":"-10.00"}]
["R20",{"$nulls":5},{"$f":"IF(F27*E27=0,\"\",VLOOKUP(E27,Lists!B$10:G$14,CEILING(F27-0.5,1)+1,TRUE))","v":""},{"$nulls":6},{"$f":"IF(M27*L27=0,\"\",VLOOKUP(L27,Lists!B$10:G$14,CEILING(M27-0.5,1)+1,TRUE))","v":""},{"$nulls":10},{"v":-10,"d":"-10.00"},{"v":-10,"d":"-10.00"},{"v":-10,"d":"-10.00"},{"v":-10,"d":"-10.00"}]
[{"$nulls":28},"X-forskyv","Y-forskyv"]
[{"$nulls":28},-0.85,-0.5]
[{"$nulls":24},"X-Konsekvens","Y-Sannsynlighet",null,null,-0.85,-0.25]
[{"$f":"A3","v":"Mål / krav nr 13:"},{"$nulls":22},"Gj sn",{"$f":"IF(F6=\"\",-10,F6-0.5)","v":{"v":-10,"d":"-10.00"}},{"$f":"IF(E6=\"\",-10,E6-0.5)","v":{"v":-10,"d":"-10.00"}},null,null,-0.85,-0.75]
[{"$f":"IF(A4=\"\",\"\",A4)","v":""},{"$nulls":23},{"$f":"IF(M6=\"\",Y31,M6-0.6)","v":{"v":-10,"d":"-10.00"}},{"$f":"IF(L6=\"\",Z31,L6-0.6)","v":{"v":-10,"d":"-10.00"}},null,null,-0.75,-0.5]
[{"$nulls":23},{"$f":"A8","v":"R1"},{"$f":"Y8","v":{"v":-10,"d":"-10.00"}},{"$f":"Z8","v":-10},null,null,-0.75,-0.25]
[null,null,"Når risikovurdering før og etter tiltak er utfylt er:",{"$nulls":21},{"$f":"AA8","v":{"v":-10,"d":"-10.00"}},{"$f":"AB8","v":-10},null,null,-0.75,-0.75]
[null,null,"● = Risikonivå før tiltak",{"$nulls":20},{"$f":"A9","v":"R2"},{"$f":"Y9","v":-10},{"$f":"Z9","v":-10},null,null,-0.66,-0.5]
[null,null,"■ = Risikonivå etter tiltak",{"$nulls":21},{"$f":"AA9","v":{"v":-10,"d":"-10.00"}},{"$f":"AB9","v":-10},null,null,-0.66,-0.25]
[{"$nulls":23},{"$f":"A10","v":"R3"},{"$f":"Y10","v":-10},{"$f":"Z10","v":-10},null,null,-0.66,-0.75]
[{"$nulls":24},{"$f":"AA10","v":-10},{"$f":"AB10","v":-10},null,null,-0.5,-0.5]
[{"$nulls":23},{"$f":"A11","v":"R4"},{"$f":"Y11","v":-10},{"$f":"Z11","v":-10},null,null,-0.5,-0.25]
[{"$nulls":24},{"$f":"AA11","v":-10},{"$f":"AB11","v":-10},null,null,-0.5,-0.75]
[{"$nulls":23},{"$f":"A12","v":"R5"},{"$f":"Y12","v":-10},{"$f":"Z12","v":-10},null,null,-0.33,-0.5]
[{"$nulls":24},{"$f":"AA12","v":-10},{"$f":"AB12","v":-10},null,null,-0.33,-0.25]
[{"$nulls":23},{"$f":"A13","v":"R6"},{"$f":"Y13","v":-10},{"$f":"Z13","v":-10},null,null,-0.33,-0.75]
[{"$nulls":24},{"$f":"AA13","v":-10},{"$f":"AB13","v":-10},null,null,-0.25,-0.5]
[{"$nulls":23},{"$f":"A14","v":"R7"},{"$f":"Y14","v":-10},{"$f":"Z14","v":-10},null,null,-0.25,-0.25]
[{"$nulls":24},{"$f":"AA14","v":-10},{"$f":"AB14","v":-10},null,null,-0.25,-0.75]
[{"$nulls":23},{"$f":"A15","v":"R8"},{"$f":"Y15","v":-10},{"$f":"Z15","v":-10},null,null,-0.15,-0.5]
[{"$nulls":24},{"$f":"AA15","v":-10},{"$f":"AB15","v":-10},null,null,-0.15,-0.25]
[{"$nulls":23},{"$f":"A16","v":"R9"},{"$f":"Y16","v":-10},{"$f":"Z16","v":-10}]
[{"$nulls":24},{"$f":"AA16","v":-10},{"$f":"AB16","v":-10}]
[{"$nulls":23},{"$f":"A17","v":"R10"},{"$f":"Y17","v":-10},{"$f":"Z17","v":-10}]
[{"$nulls":24},{"$f":"AA17","v":-10},{"$f":"AB17","v":-10}]
[{"$nulls":23},{"$f":"A18","v":"R11"},{"$f":"Y18","v":-10},{"$f":"Z18","v":-10}]
[{"$nulls":24},{"$f":"AA18","v":-10},{"$f":"AB18","v":-10}]
[{"$nulls":23},{"$f":"A19","v":"R12"},{"$f":"Y19","v":{"v":-10,"d":"-10.00"}},{"$f":"Z19","v":-10}]
[{"$nulls":24},{"$f":"AA19","v":-10},{"$f":"AB19","v":-10}]
[{"$nulls":23},{"$f":"A20","v":"R13"},{"$f":"Y20","v":-10},{"$f":"Z20","v":-10}]
[{"$nulls":24},{"$f":"AA20","v":-10},{"$f":"AB20","v":-10}]
[{"$nulls":23},{"$f":"A21","v":"R14"},{"$f":"Y21","v":-10},{"$f":"Z21","v":-10}]
[{"$nulls":24},{"$f":"AA21","v":-10},{"$f":"AB21","v":-10}]
[{"$nulls":23},{"$f":"A22","v":"R15"},{"$f":"Y22","v":-10},{"$f":"Z22","v":-10}]
[{"$nulls":24},{"$f":"AA22","v":-10},{"$f":"AB22","v":-10}]
[{"$nulls":23},{"$f":"A23","v":"R16"},{"$f":"Y23","v":{"v":-10,"d":"-10.00"}},{"$f":"Z23","v":{"v":-10,"d":"-10.00"}}]
[{"$nulls":24},{"$f":"AA23","v":{"v":-10,"d":"-10.00"}},{"$f":"AB23","v":{"v":-10,"d":"-10.00"}}]
[{"$nulls":23},{"$f":"A24","v":"R17"},{"$f":"Y24","v":{"v":-10,"d":"-10.00"}},{"$f":"Z24","v":{"v":-10,"d":"-10.00"}}]
[{"$nulls":24},{"$f":"AA24","v":{"v":-10,"d":"-10.00"}},{"$f":"AB24","v":{"v":-10,"d":"-10.00"}}]
[{"$nulls":23},{"$f":"A25","v":"R18"},{"$f":"Y25","v":{"v":-10,"d":"-10.00"}},{"$f":"Z25","v":{"v":-10,"d":"-10.00"}}]
[{"$nulls":24},{"$f":"AA25","v":{"v":-10,"d":"-10.00"}},{"$f":"AB25","v":{"v":-10,"d":"-10.00"}}]
[{"$nulls":23},{"$f":"A26","v":"R19"},{"$f":"Y26","v":{"v":-10,"d":"-10.00"}},{"$f":"Z26","v":{"v":-10,"d":"-10.00"}}]
[{"$nulls":24},{"$f":"AA26","v":{"v":-10,"d":"-10.00"}},{"$f":"AB26","v":{"v":-10,"d":"-10.00"}}]
[{"$nulls":23},{"$f":"A27","v":"R20"},{"$f":"Y27","v":{"v":-10,"d":"-10.00"}},{"$f":"Z27","v":{"v":-10,"d":"-10.00"}}]
[{"$nulls":24},{"$f":"AA27","v":{"v":-10,"d":"-10.00"}},{"$f":"AB27","v":{"v":-10,"d":"-10.00"}}]

{"sheet":"Mål 14","index":21,"n_rows":72,"n_cols":30,"rows_kept":72,"merged":[[0,0,0,3],[0,4,0,6],[0,7,0,8],[0,11,0,13],[1,2,1,3],[1,5,1,6],[1,12,1,13],[2,0,2,2],[2,4,2,6],[2,7,2,8],[2,11,2,13],[3,0,4,3],[3,4,3,5],[3,7,4,10],[3,11,3,12],[5,24,5,25],[5,26,5,27],[30,0,30,2],[31,0,32,3],[34,2,34,3],[35,2,35,3]]}
["Risikoidentifikasjon og analyse",{"$nulls":3},"Ansvarlig:",{"$nulls":6},"Risikomatrise, \nse under"]
["Enhet:",null,{"$f":"IF(Forside!C2=\"\",\"\",Forside!C2)","v":"Tjenesteområde <<tjenesteområde>>"},null,"Dato:",{"$f":"IF(Forside!C4=\"\",\"\",Forside!C4)","v":""}]
["Mål / krav nr 14:",{"$nulls":3},"Risiko før tiltak",null,null,"Deltakere i prosessen:",{"$nulls":3},"Risiko etter tiltak"]
[{"$nulls":4},"Risiko-vurdering",null,"Risiko-nivå",{"$f":"IF(Forside!C3=\"\",\"\",Forside!C3)","v":"<<deltakere>>"},{"$nulls":3},"Risiko-vurdering",null,"Risiko-nivå"]
[{"$nulls":4},"S","K",{"$nulls":5},"S","K"]
[{"$nulls":3},"Gjsn risiko for målet:",{"$f":"IF(ISERROR(AVERAGE(E8:E27)),\"\",ROUND(AVERAGE(E8:E27),0))","v":""},{"$f":"IF(ISERROR(AVERAGE(F8:F27)),\"\",ROUND(AVERAGE(F8:F27),0))","v":""},{"$f":"IF(ISERROR(E6*F6),\"\",VLOOKUP(E6,Lists!B$10:G$14,CEILING(F6-0.5,1)+1,TRUE))","v":""},{"$nulls":4},{"$f":"IF(ISERROR(AVERAGE(L8:L27)),\"\",ROUND(AVERAGE(L8:L27),0))","v":""},{"$f":"IF(ISERROR(AVERAGE(M8:M27)),\"\",ROUND(AVERAGE(M8:M27),0))","v":""},{"$f":"IF(ISERROR(L6*M6),\"\",VLOOKUP(L6,Lists!B$10:G$14,CEILING(M6-0.5,1)+1,TRUE))","v":""},{"$nulls":10},"Før tiltak",null,"Etter tiltak"]
["Risiko nr","Kritiske suksessfaktorer","Område","Eksisterende tiltak","S","K","Risiko-nivå","Risikoeier:","Nye tiltak:","Ansvarlig:","Frist:","S","K","Risiko-nivå",{"$nulls":10},"X-forskyv konsekv","Y-forskyv Sanns","X-forskyv konsekv","Y-forskyv Sanns"]
["R1",{"$nulls":5},{"$f":"IF(F8*E8=0,\"\",VLOOKUP(E8,Lists!B$10:G$14,CEILING(F8-0.5,1)+1,TRUE))","v":""},{"$nulls":6},{"$f":"IF(M8*L8=0,\"\",VLOOKUP(L8,Lists!B$10:G$14,CEILING(M8-0.5,1)+1,TRUE))","v":""},{"$nulls":10},{"$f":"IF(F8=\"\",-10,F8+AC29)","v":{"v":-10,"d":"-10.00"}},{"$f":"IF(E8=\"\",-10,E8+AD29)","v":{"v":-10,"d":"-10.00"}},{"$f":"IF(M8=\"\",Y8,M8+AC29)","v":{"v":-10,"d":"-10.00"}},{"$f":"IF(L8=\"\",Z8,L8+AD29)","v":{"v":-10,"d":"-10.00"}}]
["R2",{"$nulls":5},{"$f":"IF(F9*E9=0,\"\",VLOOKUP(E9,Lists!B$10:G$14,CEILING(F9-0.5,1)+1,TRUE))","v":""},{"$nulls":6},{"$f":"IF(M9*L9=0,\"\",VLOOKUP(L9,Lists!B$10:G$14,CEILING(M9-0.5,1)+1,TRUE))","v":""},{"$nulls":10},{"v":-10,"d":"-10.00"},{"v":-10,"d":"-10.00"},{"v":-10,"d":"-10.00"},{"v":-10,"d":"-10.00"}]
["R3",{"$nulls":5},{"$f":"IF(F10*E10=0,\"\",VLOOKUP(E10,Lists!B$10:G$14,CEILING(F10-0.5,1)+1,TRUE))","v":""},{"$nulls":6},{"$f":"IF(M10*L10=0,\"\",VLOOKUP(L10,Lists!B$10:G$14,CEILING(M10-0.5,1)+1,TRUE))","v":""},{"$nulls":10},{"v":-10,"d":"-10.00"},{"v":-10,"d":"-10.00"},{"v":-10,"d":"-10.00"},{"v":-10,"d":"-10.00"}]
["R4",{"$nulls":5},{"$f":"IF(F11*E11=0,\"\",VLOOKUP(E11,Lists!B$10:G$14,CEILING(F11-0.5,1)+1,TRUE))","v":""},{"$nulls":6},{"$f":"IF(M11*L11=0,\"\",VLOOKUP(L11,Lists!B$10:G$14,CEILING(M11-0.5,1)+1,TRUE))","v":""},{"$nulls":10},{"v":-10,"d":"-10.00"},{"v":-10,"d":"-10.00"},{"v":-10,"d":"-10.00"},{"v":-10,"d":"-10.00"}]
["R5",{"$nulls":5},{"$f":"IF(F12*E12=0,\"\",VLOOKUP(E12,Lists!B$10:G$14,CEILING(F12-0.5,1)+1,TRUE))","v":""},{"$nulls":6},{"$f":"IF(M12*L12=0,\"\",VLOOKUP(L12,Lists!B$10:G$14,CEILING(M12-0.5,1)+1,TRUE))","v":""},{"$nulls":10},{"v":-10,"d":"-10.00"},{"v":-10,"d":"-10.00"},{"v":-10,"d":"-10.00"},{"v":-10,"d":"-10.00"}]
["R6",{"$nulls":5},{"$f":"IF(F13*E13=0,\"\",VLOOKUP(E13,Lists!B$10:G$14,CEILING(F13-0.5,1)+1,TRUE))","v":""},{"$nulls":6},{"$f":"IF(M13*L13=0,\"\",VLOOKUP(L13,Lists!B$10:G$14,CEILING(M13-0.5,1)+1,TRUE))","v":""},{"$nulls":10},{"v":-10,"d":"-10.00"},{"v":-10,"d":"-10.00"},{"v":-10,"d":"-10.00"},{"v":-10,"d":"-10.00"}]
["R7",{"$nulls":5},{"$f":"IF(F14*E14=0,\"\",VLOOKUP(E14,Lists!B$10:G$14,CEILING(F14-0.5,1)+1,TRUE))","v":""},{"$nulls":6},{"$f":"IF(M14*L14=0,\"\",VLOOKUP(L14,Lists!B$10:G$14,CEILING(M14-0.5,1)+1,TRUE))","v":""},{"$nulls":10},{"v":-10,"d":"-10.00"},{"v":-10,"d":"-10.00"},{"v":-10,"d":"-10.00"},{"v":-10,"d":"-10.00"}]
["R8",{"$nulls":5},{"$f":"IF(F15*E15=0,\"\",VLOOKUP(E15,Lists!B$10:G$14,CEILING(F15-0.5,1)+1,TRUE))","v":""},{"$nulls":6},{"$f":"IF(M15*L15=0,\"\",VLOOKUP(L15,Lists!B$10:G$14,CEILING(M15-0.5,1)+1,TRUE))","v":""},{"$nulls":10},{"v":-10,"d":"-10.00"},{"v":-10,"d":"-10.00"},{"v":-10,"d":"-10.00"},{"v":-10,"d":"-10.00"}]
["R9",{"$nulls":5},{"$f":"IF(F16*E16=0,\"\",VLOOKUP(E16,Lists!B$10:G$14,CEILING(F16-0.5,1)+1,TRUE))","v":""},{"$nulls":6},{"$f":"IF(M16*L16=0,\"\",VLOOKUP(L16,Lists!B$10:G$14,CEILING(M16-0.5,1)+1,TRUE))","v":""},{"$nulls":10},{"v":-10,"d":"-10.00"},{"v":-10,"d":"-10.00"},{"v":-10,"d":"-10.00"},{"v":-10,"d":"-10.00"}]
["R10",{"$nulls":5},{"$f":"IF(F17*E17=0,\"\",VLOOKUP(E17,Lists!B$10:G$14,CEILING(F17-0.5,1)+1,TRUE))","v":""},{"$nulls":6},{"$f":"IF(M17*L17=0,\"\",VLOOKUP(L17,Lists!B$10:G$14,CEILING(M17-0.5,1)+1,TRUE))","v":""},{"$nulls":10},{"v":-10,"d":"-10.00"},{"v":-10,"d":"-10.00"},{"v":-10,"d":"-10.00"},{"v":-10,"d":"-10.00"}]
["R11",{"$nulls":5},{"$f":"IF(F18*E18=0,\"\",VLOOKUP(E18,Lists!B$10:G$14,CEILING(F18-0.5,1)+1,TRUE))","v":""},{"$nulls":6},{"$f":"IF(M18*L18=0,\"\",VLOOKUP(L18,Lists!B$10:G$14,CEILING(M18-0.5,1)+1,TRUE))","v":""},{"$nulls":10},{"v":-10,"d":"-10.00"},{"v":-10,"d":"-10.00"},{"v":-10,"d":"-10.00"},{"v":-10,"d":"-10.00"}]
["R12",{"$nulls":5},{"$f":"IF(F19*E19=0,\"\",VLOOKUP(E19,Lists!B$10:G$14,CEILING(F19-0.5,1)+1,TRUE))","v":""},{"$nulls":6},{"$f":"IF(M19*L19=0,\"\",VLOOKUP(L19,Lists!B$10:G$14,CEILING(M19-0.5,1)+1,TRUE))","v":""},{"$nulls":10},{"v":-10,"d":"-10.00"},{"v":-10,"d":"-10.00"},{"v":-10,"d":"-10.00"},{"v":-10,"d":"-10.00"}]
["R13",{"$nulls":5},{"$f":"IF(F20*E20=0,\"\",VLOOKUP(E20,Lists!B$10:G$14,CEILING(F20-0.5,1)+1,TRUE))","v":""},{"$nulls":6},{"$f":"IF(M20*L20=0,\"\",VLOOKUP(L20,Lists!B$10:G$14,CEILING(M20-0.5,1)+1,TRUE))","v":""},{"$nulls":10},{"v":-10,"d":"-10.00"},{"v":-10,"d":"-10.00"},{"v":-10,"d":"-10.00"},{"v":-10,"d":"-10.00"}]
["R14",{"$nulls":5},{"$f":"IF(F21*E21=0,\"\",VLOOKUP(E21,Lists!B$10:G$14,CEILING(F21-0.5,1)+1,TRUE))","v":""},{"$nulls":6},{"$f":"IF(M21*L21=0,\"\",VLOOKUP(L21,Lists!B$10:G$14,CEILING(M21-0.5,1)+1,TRUE))","v":""},{"$nulls":10},{"v":-10,"d":"-10.00"},{"v":-10,"d":"-10.00"},{"v":-10,"d":"-10.00"},{"v":-10,"d":"-10.00"}]
["R15",{"$nulls":5},{"$f":"IF(F22*E22=0,\"\",VLOOKUP(E22,Lists!B$10:G$14,CEILING(F22-0.5,1)+1,TRUE))","v":""},{"$nulls":6},{"$f":"IF(M22*L22=0,\"\",VLOOKUP(L22,Lists!B$10:G$14,CEILING(M22-0.5,1)+1,TRUE))","v":""},{"$nulls":10},{"v":-10,"d":"-10.00"},{"v":-10,"d":"-10.00"},{"v":-10,"d":"-10.00"},{"v":-10,"d":"-10.00"}]
["R16",{"$nulls":5},{"$f":"IF(F23*E23=0,\"\",VLOOKUP(E23,Lists!B$10:G$14,CEILING(F23-0.5,1)+1,TRUE))","v":""},{"$nulls":6},{"$f":"IF(M23*L23=0,\"\",VLOOKUP(L23,Lists!B$10:G$14,CEILING(M23-0.5,1)+1,TRUE))","v":""},{"$nulls":10},{"v":-10,"d":"-10.00"},{"v":-10,"d":"-10.00"},{"v":-10,"d":"-10.00"},{"v":-10,"d":"-10.00"}]
["R17",{"$nulls":5},{"$f":"IF(F24*E24=0,\"\",VLOOKUP(E24,Lists!B$10:G$14,CEILING(F24-0.5,1)+1,TRUE))","v":""},{"$nulls":6},{"$f":"IF(M24*L24=0,\"\",VLOOKUP(L24,Lists!B$10:G$14,CEILING(M24-0.5,1)+1,TRUE))","v":""},{"$nulls":10},{"v":-10,"d":"-10.00"},{"v":-10,"d":"-10.00"},{"v":-10,"d":"-10.00"},{"v":-10,"d":"-10.00"}]
["R18",{"$nulls":5},{"$f":"IF(F25*E25=0,\"\",VLOOKUP(E25,Lists!B$10:G$14,CEILING(F25-0.5,1)+1,TRUE))","v":""},{"$nulls":6},{"$f":"IF(M25*L25=0,\"\",VLOOKUP(L25,Lists!B$10:G$14,CEILING(M25-0.5,1)+1,TRUE))","v":""},{"$nulls":10},{"v":-10,"d":"-10.00"},{"v":-10,"d":"-10.00"},{"v":-10,"d":"-10.00"},{"v":-10,"d":"-10.00"}]
["R19",{"$nulls":5},{"$f":"IF(F26*E26=0,\"\",VLOOKUP(E26,Lists!B$10:G$14,CEILING(F26-0.5,1)+1,TRUE))","v":""},{"$nulls":6},{"$f":"IF(M26*L26=0,\"\",VLOOKUP(L26,Lists!B$10:G$14,CEILING(M26-0.5,1)+1,TRUE))","v":""},{"$nulls":10},{"v":-10,"d":"-10.00"},{"v":-10,"d":"-10.00"},{"v":-10,"d":"-10.00"},{"v":-10,"d":"-10.00"}]
["R20",{"$nulls":5},{"$f":"IF(F27*E27=0,\"\",VLOOKUP(E27,Lists!B$10:G$14,CEILING(F27-0.5,1)+1,TRUE))","v":""},{"$nulls":6},{"$f":"IF(M27*L27=0,\"\",VLOOKUP(L27,Lists!B$10:G$14,CEILING(M27-0.5,1)+1,TRUE))","v":""},{"$nulls":10},{"v":-10,"d":"-10.00"},{"v":-10,"d":"-10.00"},{"v":-10,"d":"-10.00"},{"v":-10,"d":"-10.00"}]
[{"$nulls":28},"X-forskyv","Y-forskyv"]
[{"$nulls":28},-0.85,-0.5]
[{"$nulls":24},"X-Konsekvens","Y-Sannsynlighet",null,null,-0.85,-0.25]
[{"$f":"A3","v":"Mål / krav nr 14:"},{"$nulls":22},"Gj sn",{"$f":"IF(F6=\"\",-10,F6-0.5)","v":{"v":-10,"d":"-10.00"}},{"$f":"IF(E6=\"\",-10,E6-0.5)","v":{"v":-10,"d":"-10.00"}},null,null,-0.85,-0.75]
[{"$f":"IF(A4=\"\",\"\",A4)","v":""},{"$nulls":23},{"$f":"IF(M6=\"\",Y31,M6-0.6)","v":{"v":-10,"d":"-10.00"}},{"$f":"IF(L6=\"\",Z31,L6-0.6)","v":{"v":-10,"d":"-10.00"}},null,null,-0.75,-0.5]
[{"$nulls":23},{"$f":"A8","v":"R1"},{"$f":"Y8","v":{"v":-10,"d":"-10.00"}},{"$f":"Z8","v":-10},null,null,-0.75,-0.25]
[null,null,"Når risikovurdering før og etter tiltak er utfylt er:",{"$nulls":21},{"$f":"AA8","v":{"v":-10,"d":"-10.00"}},{"$f":"AB8","v":-10},null,null,-0.75,-0.75]
[null,null,"● = Risikonivå før tiltak",{"$nulls":20},{"$f":"A9","v":"R2"},{"$f":"Y9","v":-10},{"$f":"Z9","v":-10},null,null,-0.66,-0.5]
[null,null,"■ = Risikonivå etter tiltak",{"$nulls":21},{"$f":"AA9","v":{"v":-10,"d":"-10.00"}},{"$f":"AB9","v":-10},null,null,-0.66,-0.25]
[{"$nulls":23},{"$f":"A10","v":"R3"},{"$f":"Y10","v":-10},{"$f":"Z10","v":-10},null,null,-0.66,-0.75]
[{"$nulls":24},{"$f":"AA10","v":-10},{"$f":"AB10","v":-10},null,null,-0.5,-0.5]
[{"$nulls":23},{"$f":"A11","v":"R4"},{"$f":"Y11","v":-10},{"$f":"Z11","v":-10},null,null,-0.5,-0.25]
[{"$nulls":24},{"$f":"AA11","v":-10},{"$f":"AB11","v":-10},null,null,-0.5,-0.75]
[{"$nulls":23},{"$f":"A12","v":"R5"},{"$f":"Y12","v":-10},{"$f":"Z12","v":-10},null,null,-0.33,-0.5]
[{"$nulls":24},{"$f":"AA12","v":-10},{"$f":"AB12","v":-10},null,null,-0.33,-0.25]
[{"$nulls":23},{"$f":"A13","v":"R6"},{"$f":"Y13","v":-10},{"$f":"Z13","v":-10},null,null,-0.33,-0.75]
[{"$nulls":24},{"$f":"AA13","v":-10},{"$f":"AB13","v":-10},null,null,-0.25,-0.5]
[{"$nulls":23},{"$f":"A14","v":"R7"},{"$f":"Y14","v":-10},{"$f":"Z14","v":-10},null,null,-0.25,-0.25]
[{"$nulls":24},{"$f":"AA14","v":-10},{"$f":"AB14","v":-10},null,null,-0.25,-0.75]
[{"$nulls":23},{"$f":"A15","v":"R8"},{"$f":"Y15","v":-10},{"$f":"Z15","v":-10},null,null,-0.15,-0.5]
[{"$nulls":24},{"$f":"AA15","v":-10},{"$f":"AB15","v":-10},null,null,-0.15,-0.25]
[{"$nulls":23},{"$f":"A16","v":"R9"},{"$f":"Y16","v":-10},{"$f":"Z16","v":-10}]
[{"$nulls":24},{"$f":"AA16","v":-10},{"$f":"AB16","v":-10}]
[{"$nulls":23},{"$f":"A17","v":"R10"},{"$f":"Y17","v":-10},{"$f":"Z17","v":-10}]
[{"$nulls":24},{"$f":"AA17","v":-10},{"$f":"AB17","v":-10}]
[{"$nulls":23},{"$f":"A18","v":"R11"},{"$f":"Y18","v":-10},{"$f":"Z18","v":-10}]
[{"$nulls":24},{"$f":"AA18","v":-10},{"$f":"AB18","v":-10}]
[{"$nulls":23},{"$f":"A19","v":"R12"},{"$f":"Y19","v":{"v":-10,"d":"-10.00"}},{"$f":"Z19","v":-10}]
[{"$nulls":24},{"$f":"AA19","v":-10},{"$f":"AB19","v":-10}]
[{"$nulls":23},{"$f":"A20","v":"R13"},{"$f":"Y20","v":-10},{"$f":"Z20","v":-10}]
[{"$nulls":24},{"$f":"AA20","v":-10},{"$f":"AB20","v":-10}]
[{"$nulls":23},{"$f":"A21","v":"R14"},{"$f":"Y21","v":-10},{"$f":"Z21","v":-10}]
[{"$nulls":24},{"$f":"AA21","v":-10},{"$f":"AB21","v":-10}]
[{"$nulls":23},{"$f":"A22","v":"R15"},{"$f":"Y22","v":-10},{"$f":"Z22","v":-10}]
[{"$nulls":24},{"$f":"AA22","v":-10},{"$f":"AB22","v":-10}]
[{"$nulls":23},{"$f":"A23","v":"R16"},{"$f":"Y23","v":{"v":-10,"d":"-10.00"}},{"$f":"Z23","v":{"v":-10,"d":"-10.00"}}]
[{"$nulls":24},{"$f":"AA23","v":{"v":-10,"d":"-10.00"}},{"$f":"AB23","v":{"v":-10,"d":"-10.00"}}]
[{"$nulls":23},{"$f":"A24","v":"R17"},{"$f":"Y24","v":{"v":-10,"d":"-10.00"}},{"$f":"Z24","v":{"v":-10,"d":"-10.00"}}]
[{"$nulls":24},{"$f":"AA24","v":{"v":-10,"d":"-10.00"}},{"$f":"AB24","v":{"v":-10,"d":"-10.00"}}]
[{"$nulls":23},{"$f":"A25","v":"R18"},{"$f":"Y25","v":{"v":-10,"d":"-10.00"}},{"$f":"Z25","v":{"v":-10,"d":"-10.00"}}]
[{"$nulls":24},{"$f":"AA25","v":{"v":-10,"d":"-10.00"}},{"$f":"AB25","v":{"v":-10,"d":"-10.00"}}]
[{"$nulls":23},{"$f":"A26","v":"R19"},{"$f":"Y26","v":{"v":-10,"d":"-10.00"}},{"$f":"Z26","v":{"v":-10,"d":"-10.00"}}]
[{"$nulls":24},{"$f":"AA26","v":{"v":-10,"d":"-10.00"}},{"$f":"AB26","v":{"v":-10,"d":"-10.00"}}]
[{"$nulls":23},{"$f":"A27","v":"R20"},{"$f":"Y27","v":{"v":-10,"d":"-10.00"}},{"$f":"Z27","v":{"v":-10,"d":"-10.00"}}]
[{"$nulls":24},{"$f":"AA27","v":{"v":-10,"d":"-10.00"}},{"$f":"AB27","v":{"v":-10,"d":"-10.00"}}]

{"sheet":"Mål 15","index":22,"n_rows":72,"n_cols":30,"rows_kept":72,"merged":[[0,0,0,3],[0,4,0,6],[0,7,0,8],[0,11,0,13],[1,2,1,3],[1,5,1,6],[1,12,1,13],[2,0,2,2],[2,4,2,6],[2,7,2,8],[2,11,2,13],[3,0,4,3],[3,4,3,5],[3,7,4,10],[3,11,3,12],[5,24,5,25],[5,26,5,27],[30,0,30,2],[31,0,32,3],[34,2,34,3],[35,2,35,3]]}
["Risikoidentifikasjon og analyse",{"$nulls":3},"Ansvarlig:",{"$nulls":6},"Risikomatrise, \nse under"]
["Enhet:",null,{"$f":"IF(Forside!C2=\"\",\"\",Forside!C2)","v":"Tjenesteområde <<tjenesteområde>>"},null,"Dato:",{"$f":"IF(Forside!C4=\"\",\"\",Forside!C4)","v":""}]
["Mål / resultatkrav nr 15:",{"$nulls":3},"Risiko før tiltak",null,null,"Deltakere i prosessen:",{"$nulls":3},"Risiko etter tiltak"]
[{"$nulls":4},"Risiko-vurdering",null,"Risiko-nivå",{"$f":"IF(Forside!C3=\"\",\"\",Forside!C3)","v":"<<deltakere>>"},{"$nulls":3},"Risiko-vurdering",null,"Risiko-nivå"]
[{"$nulls":4},"S","K",{"$nulls":5},"S","K"]
[{"$nulls":3},"Gjsn risiko for målet:",{"$f":"IF(ISERROR(AVERAGE(E8:E27)),\"\",ROUND(AVERAGE(E8:E27),0))","v":""},{"$f":"IF(ISERROR(AVERAGE(F8:F27)),\"\",ROUND(AVERAGE(F8:F27),0))","v":""},{"$f":"IF(ISERROR(E6*F6),\"\",VLOOKUP(E6,Lists!B$10:G$14,CEILING(F6-0.5,1)+1,TRUE))","v":""},{"$nulls":4},{"$f":"IF(ISERROR(AVERAGE(L8:L27)),\"\",ROUND(AVERAGE(L8:L27),0))","v":""},{"$f":"IF(ISERROR(AVERAGE(M8:M27)),\"\",ROUND(AVERAGE(M8:M27),0))","v":""},{"$f":"IF(ISERROR(L6*M6),\"\",VLOOKUP(L6,Lists!B$10:G$14,CEILING(M6-0.5,1)+1,TRUE))","v":""},{"$nulls":10},"Før tiltak",null,"Etter tiltak"]
["Risiko nr","Kritiske suksessfaktorer","Område","Eksisterende tiltak","S","K","Risiko-nivå","Risikoeier:","Nye tiltak:","Ansvarlig:","Frist:","S","K","Risiko-nivå",{"$nulls":10},"X-forskyv konsekv","Y-forskyv Sanns","X-forskyv konsekv","Y-forskyv Sanns"]
["R1",{"$nulls":5},{"$f":"IF(F8*E8=0,\"\",VLOOKUP(E8,Lists!B$10:G$14,CEILING(F8-0.5,1)+1,TRUE))","v":""},{"$nulls":6},{"$f":"IF(M8*L8=0,\"\",VLOOKUP(L8,Lists!B$10:G$14,CEILING(M8-0.5,1)+1,TRUE))","v":""},{"$nulls":10},{"$f":"IF(F8=\"\",-10,F8+AC29)","v":{"v":-10,"d":"-10.00"}},{"$f":"IF(E8=\"\",-10,E8+AD29)","v":{"v":-10,"d":"-10.00"}},{"$f":"IF(M8=\"\",Y8,M8+AC29)","v":{"v":-10,"d":"-10.00"}},{"$f":"IF(L8=\"\",Z8,L8+AD29)","v":{"v":-10,"d":"-10.00"}}]
["R2",{"$nulls":5},{"$f":"IF(F9*E9=0,\"\",VLOOKUP(E9,Lists!B$10:G$14,CEILING(F9-0.5,1)+1,TRUE))","v":""},{"$nulls":6},{"$f":"IF(M9*L9=0,\"\",VLOOKUP(L9,Lists!B$10:G$14,CEILING(M9-0.5,1)+1,TRUE))","v":""},{"$nulls":10},{"v":-10,"d":"-10.00"},{"v":-10,"d":"-10.00"},{"v":-10,"d":"-10.00"},{"v":-10,"d":"-10.00"}]
["R3",{"$nulls":5},{"$f":"IF(F10*E10=0,\"\",VLOOKUP(E10,Lists!B$10:G$14,CEILING(F10-0.5,1)+1,TRUE))","v":""},{"$nulls":6},{"$f":"IF(M10*L10=0,\"\",VLOOKUP(L10,Lists!B$10:G$14,CEILING(M10-0.5,1)+1,TRUE))","v":""},{"$nulls":10},{"v":-10,"d":"-10.00"},{"v":-10,"d":"-10.00"},{"v":-10,"d":"-10.00"},{"v":-10,"d":"-10.00"}]
["R4",{"$nulls":5},{"$f":"IF(F11*E11=0,\"\",VLOOKUP(E11,Lists!B$10:G$14,CEILING(F11-0.5,1)+1,TRUE))","v":""},{"$nulls":6},{"$f":"IF(M11*L11=0,\"\",VLOOKUP(L11,Lists!B$10:G$14,CEILING(M11-0.5,1)+1,TRUE))","v":""},{"$nulls":10},{"v":-10,"d":"-10.00"},{"v":-10,"d":"-10.00"},{"v":-10,"d":"-10.00"},{"v":-10,"d":"-10.00"}]
["R5",{"$nulls":5},{"$f":"IF(F12*E12=0,\"\",VLOOKUP(E12,Lists!B$10:G$14,CEILING(F12-0.5,1)+1,TRUE))","v":""},{"$nulls":6},{"$f":"IF(M12*L12=0,\"\",VLOOKUP(L12,Lists!B$10:G$14,CEILING(M12-0.5,1)+1,TRUE))","v":""},{"$nulls":10},{"v":-10,"d":"-10.00"},{"v":-10,"d":"-10.00"},{"v":-10,"d":"-10.00"},{"v":-10,"d":"-10.00"}]
["R6",{"$nulls":5},{"$f":"IF(F13*E13=0,\"\",VLOOKUP(E13,Lists!B$10:G$14,CEILING(F13-0.5,1)+1,TRUE))","v":""},{"$nulls":6},{"$f":"IF(M13*L13=0,\"\",VLOOKUP(L13,Lists!B$10:G$14,CEILING(M13-0.5,1)+1,TRUE))","v":""},{"$nulls":10},{"v":-10,"d":"-10.00"},{"v":-10,"d":"-10.00"},{"v":-10,"d":"-10.00"},{"v":-10,"d":"-10.00"}]
["R7",{"$nulls":5},{"$f":"IF(F14*E14=0,\"\",VLOOKUP(E14,Lists!B$10:G$14,CEILING(F14-0.5,1)+1,TRUE))","v":""},{"$nulls":6},{"$f":"IF(M14*L14=0,\"\",VLOOKUP(L14,Lists!B$10:G$14,CEILING(M14-0.5,1)+1,TRUE))","v":""},{"$nulls":10},{"v":-10,"d":"-10.00"},{"v":-10,"d":"-10.00"},{"v":-10,"d":"-10.00"},{"v":-10,"d":"-10.00"}]
["R8",{"$nulls":5},{"$f":"IF(F15*E15=0,\"\",VLOOKUP(E15,Lists!B$10:G$14,CEILING(F15-0.5,1)+1,TRUE))","v":""},{"$nulls":6},{"$f":"IF(M15*L15=0,\"\",VLOOKUP(L15,Lists!B$10:G$14,CEILING(M15-0.5,1)+1,TRUE))","v":""},{"$nulls":10},{"v":-10,"d":"-10.00"},{"v":-10,"d":"-10.00"},{"v":-10,"d":"-10.00"},{"v":-10,"d":"-10.00"}]
["R9",{"$nulls":5},{"$f":"IF(F16*E16=0,\"\",VLOOKUP(E16,Lists!B$10:G$14,CEILING(F16-0.5,1)+1,TRUE))","v":""},{"$nulls":6},{"$f":"IF(M16*L16=0,\"\",VLOOKUP(L16,Lists!B$10:G$14,CEILING(M16-0.5,1)+1,TRUE))","v":""},{"$nulls":10},{"v":-10,"d":"-10.00"},{"v":-10,"d":"-10.00"},{"v":-10,"d":"-10.00"},{"v":-10,"d":"-10.00"}]
["R10",{"$nulls":5},{"$f":"IF(F17*E17=0,\"\",VLOOKUP(E17,Lists!B$10:G$14,CEILING(F17-0.5,1)+1,TRUE))","v":""},{"$nulls":6},{"$f":"IF(M17*L17=0,\"\",VLOOKUP(L17,Lists!B$10:G$14,CEILING(M17-0.5,1)+1,TRUE))","v":""},{"$nulls":10},{"v":-10,"d":"-10.00"},{"v":-10,"d":"-10.00"},{"v":-10,"d":"-10.00"},{"v":-10,"d":"-10.00"}]
["R11",{"$nulls":5},{"$f":"IF(F18*E18=0,\"\",VLOOKUP(E18,Lists!B$10:G$14,CEILING(F18-0.5,1)+1,TRUE))","v":""},{"$nulls":6},{"$f":"IF(M18*L18=0,\"\",VLOOKUP(L18,Lists!B$10:G$14,CEILING(M18-0.5,1)+1,TRUE))","v":""},{"$nulls":10},{"v":-10,"d":"-10.00"},{"v":-10,"d":"-10.00"},{"v":-10,"d":"-10.00"},{"v":-10,"d":"-10.00"}]
["R12",{"$nulls":5},{"$f":"IF(F19*E19=0,\"\",VLOOKUP(E19,Lists!B$10:G$14,CEILING(F19-0.5,1)+1,TRUE))","v":""},{"$nulls":6},{"$f":"IF(M19*L19=0,\"\",VLOOKUP(L19,Lists!B$10:G$14,CEILING(M19-0.5,1)+1,TRUE))","v":""},{"$nulls":10},{"v":-10,"d":"-10.00"},{"v":-10,"d":"-10.00"},{"v":-10,"d":"-10.00"},{"v":-10,"d":"-10.00"}]
["R13",{"$nulls":5},{"$f":"IF(F20*E20=0,\"\",VLOOKUP(E20,Lists!B$10:G$14,CEILING(F20-0.5,1)+1,TRUE))","v":""},{"$nulls":6},{"$f":"IF(M20*L20=0,\"\",VLOOKUP(L20,Lists!B$10:G$14,CEILING(M20-0.5,1)+1,TRUE))","v":""},{"$nulls":10},{"v":-10,"d":"-10.00"},{"v":-10,"d":"-10.00"},{"v":-10,"d":"-10.00"},{"v":-10,"d":"-10.00"}]
["R14",{"$nulls":5},{"$f":"IF(F21*E21=0,\"\",VLOOKUP(E21,Lists!B$10:G$14,CEILING(F21-0.5,1)+1,TRUE))","v":""},{"$nulls":6},{"$f":"IF(M21*L21=0,\"\",VLOOKUP(L21,Lists!B$10:G$14,CEILING(M21-0.5,1)+1,TRUE))","v":""},{"$nulls":10},{"v":-10,"d":"-10.00"},{"v":-10,"d":"-10.00"},{"v":-10,"d":"-10.00"},{"v":-10,"d":"-10.00"}]
["R15",{"$nulls":5},{"$f":"IF(F22*E22=0,\"\",VLOOKUP(E22,Lists!B$10:G$14,CEILING(F22-0.5,1)+1,TRUE))","v":""},{"$nulls":6},{"$f":"IF(M22*L22=0,\"\",VLOOKUP(L22,Lists!B$10:G$14,CEILING(M22-0.5,1)+1,TRUE))","v":""},{"$nulls":10},{"v":-10,"d":"-10.00"},{"v":-10,"d":"-10.00"},{"v":-10,"d":"-10.00"},{"v":-10,"d":"-10.00"}]
["R16",{"$nulls":5},{"$f":"IF(F23*E23=0,\"\",VLOOKUP(E23,Lists!B$10:G$14,CEILING(F23-0.5,1)+1,TRUE))","v":""},{"$nulls":6},{"$f":"IF(M23*L23=0,\"\",VLOOKUP(L23,Lists!B$10:G$14,CEILING(M23-0.5,1)+1,TRUE))","v":""},{"$nulls":10},{"v":-10,"d":"-10.00"},{"v":-10,"d":"-10.00"},{"v":-10,"d":"-10.00"},{"v":-10,"d":"-10.00"}]
["R17",{"$nulls":5},{"$f":"IF(F24*E24=0,\"\",VLOOKUP(E24,Lists!B$10:G$14,CEILING(F24-0.5,1)+1,TRUE))","v":""},{"$nulls":6},{"$f":"IF(M24*L24=0,\"\",VLOOKUP(L24,Lists!B$10:G$14,CEILING(M24-0.5,1)+1,TRUE))","v":""},{"$nulls":10},{"v":-10,"d":"-10.00"},{"v":-10,"d":"-10.00"},{"v":-10,"d":"-10.00"},{"v":-10,"d":"-10.00"}]
["R18",{"$nulls":5},{"$f":"IF(F25*E25=0,\"\",VLOOKUP(E25,Lists!B$10:G$14,CEILING(F25-0.5,1)+1,TRUE))","v":""},{"$nulls":6},{"$f":"IF(M25*L25=0,\"\",VLOOKUP(L25,Lists!B$10:G$14,CEILING(M25-0.5,1)+1,TRUE))","v":""},{"$nulls":10},{"v":-10,"d":"-10.00"},{"v":-10,"d":"-10.00"},{"v":-10,"d":"-10.00"},{"v":-10,"d":"-10.00"}]
["R19",{"$nulls":5},{"$f":"IF(F26*E26=0,\"\",VLOOKUP(E26,Lists!B$10:G$14,CEILING(F26-0.5,1)+1,TRUE))","v":""},{"$nulls":6},{"$f":"IF(M26*L26=0,\"\",VLOOKUP(L26,Lists!B$10:G$14,CEILING(M26-0.5,1)+1,TRUE))","v":""},{"$nulls":10},{"v":-10,"d":"-10.00"},{"v":-10,"d":"-10.00"},{"v":-10,"d":"-10.00"},{"v":-10,"d":"-10.00"}]
["R20",{"$nulls":5},{"$f":"IF(F27*E27=0,\"\",VLOOKUP(E27,Lists!B$10:G$14,CEILING(F27-0.5,1)+1,TRUE))","v":""},{"$nulls":6},{"$f":"IF(M27*L27=0,\"\",VLOOKUP(L27,Lists!B$10:G$14,CEILING(M27-0.5,1)+1,TRUE))","v":""},{"$nulls":10},{"v":-10,"d":"-10.00"},{"v":-10,"d":"-10.00"},{"v":-10,"d":"-10.00"},{"v":-10,"d":"-10.00"}]
[{"$nulls":28},"X-forskyv","Y-forskyv"]
[{"$nulls":28},-0.85,-0.5]
[{"$nulls":24},"X-Konsekvens","Y-Sannsynlighet",null,null,-0.85,-0.25]
[{"$f":"A3","v":"Mål / resultatkrav nr 15:"},{"$nulls":22},"Gj sn",{"$f":"IF(F6=\"\",-10,F6-0.5)","v":{"v":-10,"d":"-10.00"}},{"$f":"IF(E6=\"\",-10,E6-0.5)","v":{"v":-10,"d":"-10.00"}},null,null,-0.85,-0.75]
[{"$f":"IF(A4=\"\",\"\",A4)","v":""},{"$nulls":23},{"$f":"IF(M6=\"\",Y31,M6-0.6)","v":{"v":-10,"d":"-10.00"}},{"$f":"IF(L6=\"\",Z31,L6-0.6)","v":{"v":-10,"d":"-10.00"}},null,null,-0.75,-0.5]
[{"$nulls":23},{"$f":"A8","v":"R1"},{"$f":"Y8","v":{"v":-10,"d":"-10.00"}},{"$f":"Z8","v":-10},null,null,-0.75,-0.25]
[null,null,"Når risikovurdering før og etter tiltak er utfylt er:",{"$nulls":21},{"$f":"AA8","v":{"v":-10,"d":"-10.00"}},{"$f":"AB8","v":-10},null,null,-0.75,-0.75]
[null,null,"● = Risikonivå før tiltak",{"$nulls":20},{"$f":"A9","v":"R2"},{"$f":"Y9","v":-10},{"$f":"Z9","v":-10},null,null,-0.66,-0.5]
[null,null,"■ = Risikonivå etter tiltak",{"$nulls":21},{"$f":"AA9","v":{"v":-10,"d":"-10.00"}},{"$f":"AB9","v":-10},null,null,-0.66,-0.25]
[{"$nulls":23},{"$f":"A10","v":"R3"},{"$f":"Y10","v":-10},{"$f":"Z10","v":-10},null,null,-0.66,-0.75]
[{"$nulls":24},{"$f":"AA10","v":-10},{"$f":"AB10","v":-10},null,null,-0.5,-0.5]
[{"$nulls":23},{"$f":"A11","v":"R4"},{"$f":"Y11","v":-10},{"$f":"Z11","v":-10},null,null,-0.5,-0.25]
[{"$nulls":24},{"$f":"AA11","v":-10},{"$f":"AB11","v":-10},null,null,-0.5,-0.75]
[{"$nulls":23},{"$f":"A12","v":"R5"},{"$f":"Y12","v":-10},{"$f":"Z12","v":-10},null,null,-0.33,-0.5]
[{"$nulls":24},{"$f":"AA12","v":-10},{"$f":"AB12","v":-10},null,null,-0.33,-0.25]
[{"$nulls":23},{"$f":"A13","v":"R6"},{"$f":"Y13","v":-10},{"$f":"Z13","v":-10},null,null,-0.33,-0.75]
[{"$nulls":24},{"$f":"AA13","v":-10},{"$f":"AB13","v":-10},null,null,-0.25,-0.5]
[{"$nulls":23},{"$f":"A14","v":"R7"},{"$f":"Y14","v":-10},{"$f":"Z14","v":-10},null,null,-0.25,-0.25]
[{"$nulls":24},{"$f":"AA14","v":-10},{"$f":"AB14","v":-10},null,null,-0.25,-0.75]
[{"$nulls":23},{"$f":"A15","v":"R8"},{"$f":"Y15","v":-10},{"$f":"Z15","v":-10},null,null,-0.15,-0.5]
[{"$nulls":24},{"$f":"AA15","v":-10},{"$f":"AB15","v":-10},null,null,-0.15,-0.25]
[{"$nulls":23},{"$f":"A16","v":"R9"},{"$f":"Y16","v":-10},{"$f":"Z16","v":-10}]
[{"$nulls":24},{"$f":"AA16","v":-10},{"$f":"AB16","v":-10}]
[{"$nulls":23},{"$f":"A17","v":"R10"},{"$f":"Y17","v":-10},{"$f":"Z17","v":-10}]
[{"$nulls":24},{"$f":"AA17","v":-10},{"$f":"AB17","v":-10}]
[{"$nulls":23},{"$f":"A18","v":"R11"},{"$f":"Y18","v":-10},{"$f":"Z18","v":-10}]
[{"$nulls":24},{"$f":"AA18","v":-10},{"$f":"AB18","v":-10}]
[{"$nulls":23},{"$f":"A19","v":"R12"},{"$f":"Y19","v":{"v":-10,"d":"-10.00"}},{"$f":"Z19","v":-10}]
[{"$nulls":24},{"$f":"AA19","v":-10},{"$f":"AB19","v":-10}]
[{"$nulls":23},{"$f":"A20","v":"R13"},{"$f":"Y20","v":-10},{"$f":"Z20","v":-10}]
[{"$nulls":24},{"$f":"AA20","v":-10},{"$f":"AB20","v":-10}]
[{"$nulls":23},{"$f":"A21","v":"R14"},{"$f":"Y21","v":-10},{"$f":"Z21","v":-10}]
[{"$nulls":24},{"$f":"AA21","v":-10},{"$f":"AB21","v":-10}]
[{"$nulls":23},{"$f":"A22","v":"R15"},{"$f":"Y22","v":-10},{"$f":"Z22","v":-10}]
[{"$nulls":24},{"$f":"AA22","v":-10},{"$f":"AB22","v":-10}]
[{"$nulls":23},{"$f":"A23","v":"R16"},{"$f":"Y23","v":{"v":-10,"d":"-10.00"}},{"$f":"Z23","v":{"v":-10,"d":"-10.00"}}]
[{"$nulls":24},{"$f":"AA23","v":{"v":-10,"d":"-10.00"}},{"$f":"AB23","v":{"v":-10,"d":"-10.00"}}]
[{"$nulls":23},{"$f":"A24","v":"R17"},{"$f":"Y24","v":{"v":-10,"d":"-10.00"}},{"$f":"Z24","v":{"v":-10,"d":"-10.00"}}]
[{"$nulls":24},{"$f":"AA24","v":{"v":-10,"d":"-10.00"}},{"$f":"AB24","v":{"v":-10,"d":"-10.00"}}]
[{"$nulls":23},{"$f":"A25","v":"R18"},{"$f":"Y25","v":{"v":-10,"d":"-10.00"}},{"$f":"Z25","v":{"v":-10,"d":"-10.00"}}]
[{"$nulls":24},{"$f":"AA25","v":{"v":-10,"d":"-10.00"}},{"$f":"AB25","v":{"v":-10,"d":"-10.00"}}]
[{"$nulls":23},{"$f":"A26","v":"R19"},{"$f":"Y26","v":{"v":-10,"d":"-10.00"}},{"$f":"Z26","v":{"v":-10,"d":"-10.00"}}]
[{"$nulls":24},{"$f":"AA26","v":{"v":-10,"d":"-10.00"}},{"$f":"AB26","v":{"v":-10,"d":"-10.00"}}]
[{"$nulls":23},{"$f":"A27","v":"R20"},{"$f":"Y27","v":{"v":-10,"d":"-10.00"}},{"$f":"Z27","v":{"v":-10,"d":"-10.00"}}]
[{"$nulls":24},{"$f":"AA27","v":{"v":-10,"d":"-10.00"}},{"$f":"AB27","v":{"v":-10,"d":"-10.00"}}]

{"sheet":"Mål 16","index":23,"n_rows":72,"n_cols":30,"rows_kept":72,"merged":[[0,0,0,3],[0,4,0,6],[0,7,0,8],[0,11,0,13],[1,2,1,3],[1,5,1,6],[1,12,1,13],[2,0,2,2],[2,4,2,6],[2,7,2,8],[2,11,2,13],[3,0,4,3],[3,4,3,5],[3,7,4,10],[3,11,3,12],[5,24,5,25],[5,26,5,27],[30,0,30,2],[31,0,32,3],[34,2,34,3],[35,2,35,3]]}
["Risikoidentifikasjon og analyse",{"$nulls":3},"Ansvarlig:",{"$nulls":6},"Risikomatrise, \nse under"]
["Enhet:",null,{"$f":"IF(Forside!C2=\"\",\"\",Forside!C2)","v":"Tjenesteområde <<tjenesteområde>>"},null,"Dato:",{"$f":"IF(Forside!C4=\"\",\"\",Forside!C4)","v":""}]
["Mål / krav nr 16:",{"$nulls":3},"Risiko før tiltak",null,null,"Deltakere i prosessen:",{"$nulls":3},"Risiko etter tiltak"]
[{"$nulls":4},"Risiko-vurdering",null,"Risiko-nivå",{"$f":"IF(Forside!C3=\"\",\"\",Forside!C3)","v":"<<deltakere>>"},{"$nulls":3},"Risiko-vurdering",null,"Risiko-nivå"]
[{"$nulls":4},"S","K",{"$nulls":5},"S","K"]
[{"$nulls":3},"Gjsn risiko for målet:",{"$f":"IF(ISERROR(AVERAGE(E8:E27)),\"\",ROUND(AVERAGE(E8:E27),0))","v":""},{"$f":"IF(ISERROR(AVERAGE(F8:F27)),\"\",ROUND(AVERAGE(F8:F27),0))","v":""},{"$f":"IF(ISERROR(E6*F6),\"\",VLOOKUP(E6,Lists!B$10:G$14,CEILING(F6-0.5,1)+1,TRUE))","v":""},{"$nulls":4},{"$f":"IF(ISERROR(AVERAGE(L8:L27)),\"\",ROUND(AVERAGE(L8:L27),0))","v":""},{"$f":"IF(ISERROR(AVERAGE(M8:M27)),\"\",ROUND(AVERAGE(M8:M27),0))","v":""},{"$f":"IF(ISERROR(L6*M6),\"\",VLOOKUP(L6,Lists!B$10:G$14,CEILING(M6-0.5,1)+1,TRUE))","v":""},{"$nulls":10},"Før tiltak",null,"Etter tiltak"]
["Risiko nr","Kritiske suksessfaktorer","Område","Eksisterende tiltak","S","K","Risiko-nivå","Risikoeier:","Nye tiltak:","Ansvarlig:","Frist:","S","K","Risiko-nivå",{"$nulls":10},"X-forskyv konsekv","Y-forskyv Sanns","X-forskyv konsekv","Y-forskyv Sanns"]
["R1",{"$nulls":5},{"$f":"IF(F8*E8=0,\"\",VLOOKUP(E8,Lists!B$10:G$14,CEILING(F8-0.5,1)+1,TRUE))","v":""},{"$nulls":6},{"$f":"IF(M8*L8=0,\"\",VLOOKUP(L8,Lists!B$10:G$14,CEILING(M8-0.5,1)+1,TRUE))","v":""},{"$nulls":10},{"$f":"IF(F8=\"\",-10,F8+AC29)","v":{"v":-10,"d":"-10.00"}},{"$f":"IF(E8=\"\",-10,E8+AD29)","v":{"v":-10,"d":"-10.00"}},{"$f":"IF(M8=\"\",Y8,M8+AC29)","v":{"v":-10,"d":"-10.00"}},{"$f":"IF(L8=\"\",Z8,L8+AD29)","v":{"v":-10,"d":"-10.00"}}]
["R2",{"$nulls":5},{"$f":"IF(F9*E9=0,\"\",VLOOKUP(E9,Lists!B$10:G$14,CEILING(F9-0.5,1)+1,TRUE))","v":""},{"$nulls":6},{"$f":"IF(M9*L9=0,\"\",VLOOKUP(L9,Lists!B$10:G$14,CEILING(M9-0.5,1)+1,TRUE))","v":""},{"$nulls":10},{"v":-10,"d":"-10.00"},{"v":-10,"d":"-10.00"},{"v":-10,"d":"-10.00"},{"v":-10,"d":"-10.00"}]
["R3",{"$nulls":5},{"$f":"IF(F10*E10=0,\"\",VLOOKUP(E10,Lists!B$10:G$14,CEILING(F10-0.5,1)+1,TRUE))","v":""},{"$nulls":6},{"$f":"IF(M10*L10=0,\"\",VLOOKUP(L10,Lists!B$10:G$14,CEILING(M10-0.5,1)+1,TRUE))","v":""},{"$nulls":10},{"v":-10,"d":"-10.00"},{"v":-10,"d":"-10.00"},{"v":-10,"d":"-10.00"},{"v":-10,"d":"-10.00"}]
["R4",{"$nulls":5},{"$f":"IF(F11*E11=0,\"\",VLOOKUP(E11,Lists!B$10:G$14,CEILING(F11-0.5,1)+1,TRUE))","v":""},{"$nulls":6},{"$f":"IF(M11*L11=0,\"\",VLOOKUP(L11,Lists!B$10:G$14,CEILING(M11-0.5,1)+1,TRUE))","v":""},{"$nulls":10},{"v":-10,"d":"-10.00"},{"v":-10,"d":"-10.00"},{"v":-10,"d":"-10.00"},{"v":-10,"d":"-10.00"}]
["R5",{"$nulls":5},{"$f":"IF(F12*E12=0,\"\",VLOOKUP(E12,Lists!B$10:G$14,CEILING(F12-0.5,1)+1,TRUE))","v":""},{"$nulls":6},{"$f":"IF(M12*L12=0,\"\",VLOOKUP(L12,Lists!B$10:G$14,CEILING(M12-0.5,1)+1,TRUE))","v":""},{"$nulls":10},{"v":-10,"d":"-10.00"},{"v":-10,"d":"-10.00"},{"v":-10,"d":"-10.00"},{"v":-10,"d":"-10.00"}]
["R6",{"$nulls":5},{"$f":"IF(F13*E13=0,\"\",VLOOKUP(E13,Lists!B$10:G$14,CEILING(F13-0.5,1)+1,TRUE))","v":""},{"$nulls":6},{"$f":"IF(M13*L13=0,\"\",VLOOKUP(L13,Lists!B$10:G$14,CEILING(M13-0.5,1)+1,TRUE))","v":""},{"$nulls":10},{"v":-10,"d":"-10.00"},{"v":-10,"d":"-10.00"},{"v":-10,"d":"-10.00"},{"v":-10,"d":"-10.00"}]
["R7",{"$nulls":5},{"$f":"IF(F14*E14=0,\"\",VLOOKUP(E14,Lists!B$10:G$14,CEILING(F14-0.5,1)+1,TRUE))","v":""},{"$nulls":6},{"$f":"IF(M14*L14=0,\"\",VLOOKUP(L14,Lists!B$10:G$14,CEILING(M14-0.5,1)+1,TRUE))","v":""},{"$nulls":10},{"v":-10,"d":"-10.00"},{"v":-10,"d":"-10.00"},{"v":-10,"d":"-10.00"},{"v":-10,"d":"-10.00"}]
["R8",{"$nulls":5},{"$f":"IF(F15*E15=0,\"\",VLOOKUP(E15,Lists!B$10:G$14,CEILING(F15-0.5,1)+1,TRUE))","v":""},{"$nulls":6},{"$f":"IF(M15*L15=0,\"\",VLOOKUP(L15,Lists!B$10:G$14,CEILING(M15-0.5,1)+1,TRUE))","v":""},{"$nulls":10},{"v":-10,"d":"-10.00"},{"v":-10,"d":"-10.00"},{"v":-10,"d":"-10.00"},{"v":-10,"d":"-10.00"}]
["R9",{"$nulls":5},{"$f":"IF(F16*E16=0,\"\",VLOOKUP(E16,Lists!B$10:G$14,CEILING(F16-0.5,1)+1,TRUE))","v":""},{"$nulls":6},{"$f":"IF(M16*L16=0,\"\",VLOOKUP(L16,Lists!B$10:G$14,CEILING(M16-0.5,1)+1,TRUE))","v":""},{"$nulls":10},{"v":-10,"d":"-10.00"},{"v":-10,"d":"-10.00"},{"v":-10,"d":"-10.00"},{"v":-10,"d":"-10.00"}]
["R10",{"$nulls":5},{"$f":"IF(F17*E17=0,\"\",VLOOKUP(E17,Lists!B$10:G$14,CEILING(F17-0.5,1)+1,TRUE))","v":""},{"$nulls":6},{"$f":"IF(M17*L17=0,\"\",VLOOKUP(L17,Lists!B$10:G$14,CEILING(M17-0.5,1)+1,TRUE))","v":""},{"$nulls":10},{"v":-10,"d":"-10.00"},{"v":-10,"d":"-10.00"},{"v":-10,"d":"-10.00"},{"v":-10,"d":"-10.00"}]
["R11",{"$nulls":5},{"$f":"IF(F18*E18=0,\"\",VLOOKUP(E18,Lists!B$10:G$14,CEILING(F18-0.5,1)+1,TRUE))","v":""},{"$nulls":6},{"$f":"IF(M18*L18=0,\"\",VLOOKUP(L18,Lists!B$10:G$14,CEILING(M18-0.5,1)+1,TRUE))","v":""},{"$nulls":10},{"v":-10,"d":"-10.00"},{"v":-10,"d":"-10.00"},{"v":-10,"d":"-10.00"},{"v":-10,"d":"-10.00"}]
["R12",{"$nulls":5},{"$f":"IF(F19*E19=0,\"\",VLOOKUP(E19,Lists!B$10:G$14,CEILING(F19-0.5,1)+1,TRUE))","v":""},{"$nulls":6},{"$f":"IF(M19*L19=0,\"\",VLOOKUP(L19,Lists!B$10:G$14,CEILING(M19-0.5,1)+1,TRUE))","v":""},{"$nulls":10},{"v":-10,"d":"-10.00"},{"v":-10,"d":"-10.00"},{"v":-10,"d":"-10.00"},{"v":-10,"d":"-10.00"}]
["R13",{"$nulls":5},{"$f":"IF(F20*E20=0,\"\",VLOOKUP(E20,Lists!B$10:G$14,CEILING(F20-0.5,1)+1,TRUE))","v":""},{"$nulls":6},{"$f":"IF(M20*L20=0,\"\",VLOOKUP(L20,Lists!B$10:G$14,CEILING(M20-0.5,1)+1,TRUE))","v":""},{"$nulls":10},{"v":-10,"d":"-10.00"},{"v":-10,"d":"-10.00"},{"v":-10,"d":"-10.00"},{"v":-10,"d":"-10.00"}]
["R14",{"$nulls":5},{"$f":"IF(F21*E21=0,\"\",VLOOKUP(E21,Lists!B$10:G$14,CEILING(F21-0.5,1)+1,TRUE))","v":""},{"$nulls":6},{"$f":"IF(M21*L21=0,\"\",VLOOKUP(L21,Lists!B$10:G$14,CEILING(M21-0.5,1)+1,TRUE))","v":""},{"$nulls":10},{"v":-10,"d":"-10.00"},{"v":-10,"d":"-10.00"},{"v":-10,"d":"-10.00"},{"v":-10,"d":"-10.00"}]
["R15",{"$nulls":5},{"$f":"IF(F22*E22=0,\"\",VLOOKUP(E22,Lists!B$10:G$14,CEILING(F22-0.5,1)+1,TRUE))","v":""},{"$nulls":6},{"$f":"IF(M22*L22=0,\"\",VLOOKUP(L22,Lists!B$10:G$14,CEILING(M22-0.5,1)+1,TRUE))","v":""},{"$nulls":10},{"v":-10,"d":"-10.00"},{"v":-10,"d":"-10.00"},{"v":-10,"d":"-10.00"},{"v":-10,"d":"-10.00"}]
["R16",{"$nulls":5},{"$f":"IF(F23*E23=0,\"\",VLOOKUP(E23,Lists!B$10:G$14,CEILING(F23-0.5,1)+1,TRUE))","v":""},{"$nulls":6},{"$f":"IF(M23*L23=0,\"\",VLOOKUP(L23,Lists!B$10:G$14,CEILING(M23-0.5,1)+1,TRUE))","v":""},{"$nulls":10},{"v":-10,"d":"-10.00"},{"v":-10,"d":"-10.00"},{"v":-10,"d":"-10.00"},{"v":-10,"d":"-10.00"}]
["R17",{"$nulls":5},{"$f":"IF(F24*E24=0,\"\",VLOOKUP(E24,Lists!B$10:G$14,CEILING(F24-0.5,1)+1,TRUE))","v":""},{"$nulls":6},{"$f":"IF(M24*L24=0,\"\",VLOOKUP(L24,Lists!B$10:G$14,CEILING(M24-0.5,1)+1,TRUE))","v":""},{"$nulls":10},{"v":-10,"d":"-10.00"},{"v":-10,"d":"-10.00"},{"v":-10,"d":"-10.00"},{"v":-10,"d":"-10.00"}]
["R18",{"$nulls":5},{"$f":"IF(F25*E25=0,\"\",VLOOKUP(E25,Lists!B$10:G$14,CEILING(F25-0.5,1)+1,TRUE))","v":""},{"$nulls":6},{"$f":"IF(M25*L25=0,\"\",VLOOKUP(L25,Lists!B$10:G$14,CEILING(M25-0.5,1)+1,TRUE))","v":""},{"$nulls":10},{"v":-10,"d":"-10.00"},{"v":-10,"d":"-10.00"},{"v":-10,"d":"-10.00"},{"v":-10,"d":"-10.00"}]
["R19",{"$nulls":5},{"$f":"IF(F26*E26=0,\"\",VLOOKUP(E26,Lists!B$10:G$14,CEILING(F26-0.5,1)+1,TRUE))","v":""},{"$nulls":6},{"$f":"IF(M26*L26=0,\"\",VLOOKUP(L26,Lists!B$10:G$14,CEILING(M26-0.5,1)+1,TRUE))","v":""},{"$nulls":10},{"v":-10,"d":"-10.00"},{"v":-10,"d":"-10.00"},{"v":-10,"d":"-10.00"},{"v":-10,"d":"-10.00"}]
["R20",{"$nulls":5},{"$f":"IF(F27*E27=0,\"\",VLOOKUP(E27,Lists!B$10:G$14,CEILING(F27-0.5,1)+1,TRUE))","v":""},{"$nulls":6},{"$f":"IF(M27*L27=0,\"\",VLOOKUP(L27,Lists!B$10:G$14,CEILING(M27-0.5,1)+1,TRUE))","v":""},{"$nulls":10},{"v":-10,"d":"-10.00"},{"v":-10,"d":"-10.00"},{"v":-10,"d":"-10.00"},{"v":-10,"d":"-10.00"}]
[{"$nulls":28},"X-forskyv","Y-forskyv"]
[{"$nulls":28},-0.85,-0.5]
[{"$nulls":24},"X-Konsekvens","Y-Sannsynlighet",null,null,-0.85,-0.25]
[{"$f":"A3","v":"Mål / krav nr 16:"},{"$nulls":22},"Gj sn",{"$f":"IF(F6=\"\",-10,F6-0.5)","v":{"v":-10,"d":"-10.00"}},{"$f":"IF(E6=\"\",-10,E6-0.5)","v":{"v":-10,"d":"-10.00"}},null,null,-0.85,-0.75]
[{"$f":"IF(A4=\"\",\"\",A4)","v":""},{"$nulls":23},{"$f":"IF(M6=\"\",Y31,M6-0.6)","v":{"v":-10,"d":"-10.00"}},{"$f":"IF(L6=\"\",Z31,L6-0.6)","v":{"v":-10,"d":"-10.00"}},null,null,-0.75,-0.5]
[{"$nulls":23},{"$f":"A8","v":"R1"},{"$f":"Y8","v":{"v":-10,"d":"-10.00"}},{"$f":"Z8","v":-10},null,null,-0.75,-0.25]
[null,null,"Når risikovurdering før og etter tiltak er utfylt er:",{"$nulls":21},{"$f":"AA8","v":{"v":-10,"d":"-10.00"}},{"$f":"AB8","v":-10},null,null,-0.75,-0.75]
[null,null,"● = Risikonivå før tiltak",{"$nulls":20},{"$f":"A9","v":"R2"},{"$f":"Y9","v":-10},{"$f":"Z9","v":-10},null,null,-0.66,-0.5]
[null,null,"■ = Risikonivå etter tiltak",{"$nulls":21},{"$f":"AA9","v":{"v":-10,"d":"-10.00"}},{"$f":"AB9","v":-10},null,null,-0.66,-0.25]
[{"$nulls":23},{"$f":"A10","v":"R3"},{"$f":"Y10","v":-10},{"$f":"Z10","v":-10},null,null,-0.66,-0.75]
[{"$nulls":24},{"$f":"AA10","v":-10},{"$f":"AB10","v":-10},null,null,-0.5,-0.5]
[{"$nulls":23},{"$f":"A11","v":"R4"},{"$f":"Y11","v":-10},{"$f":"Z11","v":-10},null,null,-0.5,-0.25]
[{"$nulls":24},{"$f":"AA11","v":-10},{"$f":"AB11","v":-10},null,null,-0.5,-0.75]
[{"$nulls":23},{"$f":"A12","v":"R5"},{"$f":"Y12","v":-10},{"$f":"Z12","v":-10},null,null,-0.33,-0.5]
[{"$nulls":24},{"$f":"AA12","v":-10},{"$f":"AB12","v":-10},null,null,-0.33,-0.25]
[{"$nulls":23},{"$f":"A13","v":"R6"},{"$f":"Y13","v":-10},{"$f":"Z13","v":-10},null,null,-0.33,-0.75]
[{"$nulls":24},{"$f":"AA13","v":-10},{"$f":"AB13","v":-10},null,null,-0.25,-0.5]
[{"$nulls":23},{"$f":"A14","v":"R7"},{"$f":"Y14","v":-10},{"$f":"Z14","v":-10},null,null,-0.25,-0.25]
[{"$nulls":24},{"$f":"AA14","v":-10},{"$f":"AB14","v":-10},null,null,-0.25,-0.75]
[{"$nulls":23},{"$f":"A15","v":"R8"},{"$f":"Y15","v":-10},{"$f":"Z15","v":-10},null,null,-0.15,-0.5]
[{"$nulls":24},{"$f":"AA15","v":-10},{"$f":"AB15","v":-10},null,null,-0.15,-0.25]
[{"$nulls":23},{"$f":"A16","v":"R9"},{"$f":"Y16","v":-10},{"$f":"Z16","v":-10}]
[{"$nulls":24},{"$f":"AA16","v":-10},{"$f":"AB16","v":-10}]
[{"$nulls":23},{"$f":"A17","v":"R10"},{"$f":"Y17","v":-10},{"$f":"Z17","v":-10}]
[{"$nulls":24},{"$f":"AA17","v":-10},{"$f":"AB17","v":-10}]
[{"$nulls":23},{"$f":"A18","v":"R11"},{"$f":"Y18","v":-10},{"$f":"Z18","v":-10}]
[{"$nulls":24},{"$f":"AA18","v":-10},{"$f":"AB18","v":-10}]
[{"$nulls":23},{"$f":"A19","v":"R12"},{"$f":"Y19","v":{"v":-10,"d":"-10.00"}},{"$f":"Z19","v":-10}]
[{"$nulls":24},{"$f":"AA19","v":-10},{"$f":"AB19","v":-10}]
[{"$nulls":23},{"$f":"A20","v":"R13"},{"$f":"Y20","v":-10},{"$f":"Z20","v":-10}]
[{"$nulls":24},{"$f":"AA20","v":-10},{"$f":"AB20","v":-10}]
[{"$nulls":23},{"$f":"A21","v":"R14"},{"$f":"Y21","v":-10},{"$f":"Z21","v":-10}]
[{"$nulls":24},{"$f":"AA21","v":-10},{"$f":"AB21","v":-10}]
[{"$nulls":23},{"$f":"A22","v":"R15"},{"$f":"Y22","v":-10},{"$f":"Z22","v":-10}]
[{"$nulls":24},{"$f":"AA22","v":-10},{"$f":"AB22","v":-10}]
[{"$nulls":23},{"$f":"A23","v":"R16"},{"$f":"Y23","v":{"v":-10,"d":"-10.00"}},{"$f":"Z23","v":{"v":-10,"d":"-10.00"}}]
[{"$nulls":24},{"$f":"AA23","v":{"v":-10,"d":"-10.00"}},{"$f":"AB23","v":{"v":-10,"d":"-10.00"}}]
[{"$nulls":23},{"$f":"A24","v":"R17"},{"$f":"Y24","v":{"v":-10,"d":"-10.00"}},{"$f":"Z24","v":{"v":-10,"d":"-10.00"}}]
[{"$nulls":24},{"$f":"AA24","v":{"v":-10,"d":"-10.00"}},{"$f":"AB24","v":{"v":-10,"d":"-10.00"}}]
[{"$nulls":23},{"$f":"A25","v":"R18"},{"$f":"Y25","v":{"v":-10,"d":"-10.00"}},{"$f":"Z25","v":{"v":-10,"d":"-10.00"}}]
[{"$nulls":24},{"$f":"AA25","v":{"v":-10,"d":"-10.00"}},{"$f":"AB25","v":{"v":-10,"d":"-10.00"}}]
[{"$nulls":23},{"$f":"A26","v":"R19"},{"$f":"Y26","v":{"v":-10,"d":"-10.00"}},{"$f":"Z26","v":{"v":-10,"d":"-10.00"}}]
[{"$nulls":24},{"$f":"AA26","v":{"v":-10,"d":"-10.00"}},{"$f":"AB26","v":{"v":-10,"d":"-10.00"}}]
[{"$nulls":23},{"$f":"A27","v":"R20"},{"$f":"Y27","v":{"v":-10,"d":"-10.00"}},{"$f":"Z27","v":{"v":-10,"d":"-10.00"}}]
[{"$nulls":24},{"$f":"AA27","v":{"v":-10,"d":"-10.00"}},{"$f":"AB27","v":{"v":-10,"d":"-10.00"}}]

{"sheet":"Mål 17","index":24,"n_rows":72,"n_cols":30,"rows_kept":72,"merged":[[0,0,0,3],[0,4,0,6],[0,7,0,8],[0,11,0,13],[1,2,1,3],[1,5,1,6],[1,12,1,13],[2,0,2,2],[2,4,2,6],[2,7,2,8],[2,11,2,13],[3,0,4,3],[3,4,3,5],[3,7,4,10],[3,11,3,12],[5,24,5,25],[5,26,5,27],[30,0,30,2],[31,0,32,3],[34,2,34,3],[35,2,35,3]]}
["Risikoidentifikasjon og analyse",{"$nulls":3},"Ansvarlig:",{"$nulls":6},"Risikomatrise, \nse under"]
["Enhet:",null,{"$f":"IF(Forside!C2=\"\",\"\",Forside!C2)","v":"Tjenesteområde <<tjenesteområde>>"},null,"Dato:",{"$f":"IF(Forside!C4=\"\",\"\",Forside!C4)","v":""}]
["Mål / krav nr 17:",{"$nulls":3},"Risiko før tiltak",null,null,"Deltakere i prosessen:",{"$nulls":3},"Risiko etter tiltak"]
[{"$nulls":4},"Risiko-vurdering",null,"Risiko-nivå",{"$f":"IF(Forside!C3=\"\",\"\",Forside!C3)","v":"<<deltakere>>"},{"$nulls":3},"Risiko-vurdering",null,"Risiko-nivå"]
[{"$nulls":4},"S","K",{"$nulls":5},"S","K"]
[{"$nulls":3},"Gjsn risiko for målet:",{"$f":"IF(ISERROR(AVERAGE(E8:E27)),\"\",ROUND(AVERAGE(E8:E27),0))","v":""},{"$f":"IF(ISERROR(AVERAGE(F8:F27)),\"\",ROUND(AVERAGE(F8:F27),0))","v":""},{"$f":"IF(ISERROR(E6*F6),\"\",VLOOKUP(E6,Lists!B$10:G$14,CEILING(F6-0.5,1)+1,TRUE))","v":""},{"$nulls":4},{"$f":"IF(ISERROR(AVERAGE(L8:L27)),\"\",ROUND(AVERAGE(L8:L27),0))","v":""},{"$f":"IF(ISERROR(AVERAGE(M8:M27)),\"\",ROUND(AVERAGE(M8:M27),0))","v":""},{"$f":"IF(ISERROR(L6*M6),\"\",VLOOKUP(L6,Lists!B$10:G$14,CEILING(M6-0.5,1)+1,TRUE))","v":""},{"$nulls":10},"Før tiltak",null,"Etter tiltak"]
["Risiko nr","Kritiske suksessfaktorer","Område","Eksisterende tiltak","S","K","Risiko-nivå","Risikoeier:","Nye tiltak:","Ansvarlig:","Frist:","S","K","Risiko-nivå",{"$nulls":10},"X-forskyv konsekv","Y-forskyv Sanns","X-forskyv konsekv","Y-forskyv Sanns"]
["R1",{"$nulls":5},{"$f":"IF(F8*E8=0,\"\",VLOOKUP(E8,Lists!B$10:G$14,CEILING(F8-0.5,1)+1,TRUE))","v":""},{"$nulls":6},{"$f":"IF(M8*L8=0,\"\",VLOOKUP(L8,Lists!B$10:G$14,CEILING(M8-0.5,1)+1,TRUE))","v":""},{"$nulls":10},{"$f":"IF(F8=\"\",-10,F8+AC29)","v":{"v":-10,"d":"-10.00"}},{"$f":"IF(E8=\"\",-10,E8+AD29)","v":{"v":-10,"d":"-10.00"}},{"$f":"IF(M8=\"\",Y8,M8+AC29)","v":{"v":-10,"d":"-10.00"}},{"$f":"IF(L8=\"\",Z8,L8+AD29)","v":{"v":-10,"d":"-10.00"}}]
["R2",{"$nulls":5},{"$f":"IF(F9*E9=0,\"\",VLOOKUP(E9,Lists!B$10:G$14,CEILING(F9-0.5,1)+1,TRUE))","v":""},{"$nulls":6},{"$f":"IF(M9*L9=0,\"\",VLOOKUP(L9,Lists!B$10:G$14,CEILING(M9-0.5,1)+1,TRUE))","v":""},{"$nulls":10},{"v":-10,"d":"-10.00"},{"v":-10,"d":"-10.00"},{"v":-10,"d":"-10.00"},{"v":-10,"d":"-10.00"}]
["R3",{"$nulls":5},{"$f":"IF(F10*E10=0,\"\",VLOOKUP(E10,Lists!B$10:G$14,CEILING(F10-0.5,1)+1,TRUE))","v":""},{"$nulls":6},{"$f":"IF(M10*L10=0,\"\",VLOOKUP(L10,Lists!B$10:G$14,CEILING(M10-0.5,1)+1,TRUE))","v":""},{"$nulls":10},{"v":-10,"d":"-10.00"},{"v":-10,"d":"-10.00"},{"v":-10,"d":"-10.00"},{"v":-10,"d":"-10.00"}]
["R4",{"$nulls":5},{"$f":"IF(F11*E11=0,\"\",VLOOKUP(E11,Lists!B$10:G$14,CEILING(F11-0.5,1)+1,TRUE))","v":""},{"$nulls":6},{"$f":"IF(M11*L11=0,\"\",VLOOKUP(L11,Lists!B$10:G$14,CEILING(M11-0.5,1)+1,TRUE))","v":""},{"$nulls":10},{"v":-10,"d":"-10.00"},{"v":-10,"d":"-10.00"},{"v":-10,"d":"-10.00"},{"v":-10,"d":"-10.00"}]
["R5",{"$nulls":5},{"$f":"IF(F12*E12=0,\"\",VLOOKUP(E12,Lists!B$10:G$14,CEILING(F12-0.5,1)+1,TRUE))","v":""},{"$nulls":6},{"$f":"IF(M12*L12=0,\"\",VLOOKUP(L12,Lists!B$10:G$14,CEILING(M12-0.5,1)+1,TRUE))","v":""},{"$nulls":10},{"v":-10,"d":"-10.00"},{"v":-10,"d":"-10.00"},{"v":-10,"d":"-10.00"},{"v":-10,"d":"-10.00"}]
["R6",{"$nulls":5},{"$f":"IF(F13*E13=0,\"\",VLOOKUP(E13,Lists!B$10:G$14,CEILING(F13-0.5,1)+1,TRUE))","v":""},{"$nulls":6},{"$f":"IF(M13*L13=0,\"\",VLOOKUP(L13,Lists!B$10:G$14,CEILING(M13-0.5,1)+1,TRUE))","v":""},{"$nulls":10},{"v":-10,"d":"-10.00"},{"v":-10,"d":"-10.00"},{"v":-10,"d":"-10.00"},{"v":-10,"d":"-10.00"}]
["R7",{"$nulls":5},{"$f":"IF(F14*E14=0,\"\",VLOOKUP(E14,Lists!B$10:G$14,CEILING(F14-0.5,1)+1,TRUE))","v":""},{"$nulls":6},{"$f":"IF(M14*L14=0,\"\",VLOOKUP(L14,Lists!B$10:G$14,CEILING(M14-0.5,1)+1,TRUE))","v":""},{"$nulls":10},{"v":-10,"d":"-10.00"},{"v":-10,"d":"-10.00"},{"v":-10,"d":"-10.00"},{"v":-10,"d":"-10.00"}]
["R8",{"$nulls":5},{"$f":"IF(F15*E15=0,\"\",VLOOKUP(E15,Lists!B$10:G$14,CEILING(F15-0.5,1)+1,TRUE))","v":""},{"$nulls":6},{"$f":"IF(M15*L15=0,\"\",VLOOKUP(L15,Lists!B$10:G$14,CEILING(M15-0.5,1)+1,TRUE))","v":""},{"$nulls":10},{"v":-10,"d":"-10.00"},{"v":-10,"d":"-10.00"},{"v":-10,"d":"-10.00"},{"v":-10,"d":"-10.00"}]
["R9",{"$nulls":5},{"$f":"IF(F16*E16=0,\"\",VLOOKUP(E16,Lists!B$10:G$14,CEILING(F16-0.5,1)+1,TRUE))","v":""},{"$nulls":6},{"$f":"IF(M16*L16=0,\"\",VLOOKUP(L16,Lists!B$10:G$14,CEILING(M16-0.5,1)+1,TRUE))","v":""},{"$nulls":10},{"v":-10,"d":"-10.00"},{"v":-10,"d":"-10.00"},{"v":-10,"d":"-10.00"},{"v":-10,"d":"-10.00"}]
["R10",{"$nulls":5},{"$f":"IF(F17*E17=0,\"\",VLOOKUP(E17,Lists!B$10:G$14,CEILING(F17-0.5,1)+1,TRUE))","v":""},{"$nulls":6},{"$f":"IF(M17*L17=0,\"\",VLOOKUP(L17,Lists!B$10:G$14,CEILING(M17-0.5,1)+1,TRUE))","v":""},{"$nulls":10},{"v":-10,"d":"-10.00"},{"v":-10,"d":"-10.00"},{"v":-10,"d":"-10.00"},{"v":-10,"d":"-10.00"}]
["R11",{"$nulls":5},{"$f":"IF(F18*E18=0,\"\",VLOOKUP(E18,Lists!B$10:G$14,CEILING(F18-0.5,1)+1,TRUE))","v":""},{"$nulls":6},{"$f":"IF(M18*L18=0,\"\",VLOOKUP(L18,Lists!B$10:G$14,CEILING(M18-0.5,1)+1,TRUE))","v":""},{"$nulls":10},{"v":-10,"d":"-10.00"},{"v":-10,"d":"-10.00"},{"v":-10,"d":"-10.00"},{"v":-10,"d":"-10.00"}]
["R12",{"$nulls":5},{"$f":"IF(F19*E19=0,\"\",VLOOKUP(E19,Lists!B$10:G$14,CEILING(F19-0.5,1)+1,TRUE))","v":""},{"$nulls":6},{"$f":"IF(M19*L19=0,\"\",VLOOKUP(L19,Lists!B$10:G$14,CEILING(M19-0.5,1)+1,TRUE))","v":""},{"$nulls":10},{"v":-10,"d":"-10.00"},{"v":-10,"d":"-10.00"},{"v":-10,"d":"-10.00"},{"v":-10,"d":"-10.00"}]
["R13",{"$nulls":5},{"$f":"IF(F20*E20=0,\"\",VLOOKUP(E20,Lists!B$10:G$14,CEILING(F20-0.5,1)+1,TRUE))","v":""},{"$nulls":6},{"$f":"IF(M20*L20=0,\"\",VLOOKUP(L20,Lists!B$10:G$14,CEILING(M20-0.5,1)+1,TRUE))","v":""},{"$nulls":10},{"v":-10,"d":"-10.00"},{"v":-10,"d":"-10.00"},{"v":-10,"d":"-10.00"},{"v":-10,"d":"-10.00"}]
["R14",{"$nulls":5},{"$f":"IF(F21*E21=0,\"\",VLOOKUP(E21,Lists!B$10:G$14,CEILING(F21-0.5,1)+1,TRUE))","v":""},{"$nulls":6},{"$f":"IF(M21*L21=0,\"\",VLOOKUP(L21,Lists!B$10:G$14,CEILING(M21-0.5,1)+1,TRUE))","v":""},{"$nulls":10},{"v":-10,"d":"-10.00"},{"v":-10,"d":"-10.00"},{"v":-10,"d":"-10.00"},{"v":-10,"d":"-10.00"}]
["R15",{"$nulls":5},{"$f":"IF(F22*E22=0,\"\",VLOOKUP(E22,Lists!B$10:G$14,CEILING(F22-0.5,1)+1,TRUE))","v":""},{"$nulls":6},{"$f":"IF(M22*L22=0,\"\",VLOOKUP(L22,Lists!B$10:G$14,CEILING(M22-0.5,1)+1,TRUE))","v":""},{"$nulls":10},{"v":-10,"d":"-10.00"},{"v":-10,"d":"-10.00"},{"v":-10,"d":"-10.00"},{"v":-10,"d":"-10.00"}]
["R16",{"$nulls":5},{"$f":"IF(F23*E23=0,\"\",VLOOKUP(E23,Lists!B$10:G$14,CEILING(F23-0.5,1)+1,TRUE))","v":""},{"$nulls":6},{"$f":"IF(M23*L23=0,\"\",VLOOKUP(L23,Lists!B$10:G$14,CEILING(M23-0.5,1)+1,TRUE))","v":""},{"$nulls":10},{"v":-10,"d":"-10.00"},{"v":-10,"d":"-10.00"},{"v":-10,"d":"-10.00"},{"v":-10,"d":"-10.00"}]
["R17",{"$nulls":5},{"$f":"IF(F24*E24=0,\"\",VLOOKUP(E24,Lists!B$10:G$14,CEILING(F24-0.5,1)+1,TRUE))","v":""},{"$nulls":6},{"$f":"IF(M24*L24=0,\"\",VLOOKUP(L24,Lists!B$10:G$14,CEILING(M24-0.5,1)+1,TRUE))","v":""},{"$nulls":10},{"v":-10,"d":"-10.00"},{"v":-10,"d":"-10.00"},{"v":-10,"d":"-10.00"},{"v":-10,"d":"-10.00"}]
["R18",{"$nulls":5},{"$f":"IF(F25*E25=0,\"\",VLOOKUP(E25,Lists!B$10:G$14,CEILING(F25-0.5,1)+1,TRUE))","v":""},{"$nulls":6},{"$f":"IF(M25*L25=0,\"\",VLOOKUP(L25,Lists!B$10:G$14,CEILING(M25-0.5,1)+1,TRUE))","v":""},{"$nulls":10},{"v":-10,"d":"-10.00"},{"v":-10,"d":"-10.00"},{"v":-10,"d":"-10.00"},{"v":-10,"d":"-10.00"}]
["R19",{"$nulls":5},{"$f":"IF(F26*E26=0,\"\",VLOOKUP(E26,Lists!B$10:G$14,CEILING(F26-0.5,1)+1,TRUE))","v":""},{"$nulls":6},{"$f":"IF(M26*L26=0,\"\",VLOOKUP(L26,Lists!B$10:G$14,CEILING(M26-0.5,1)+1,TRUE))","v":""},{"$nulls":10},{"v":-10,"d":"-10.00"},{"v":-10,"d":"-10.00"},{"v":-10,"d":"-10.00"},{"v":-10,"d":"-10.00"}]
["R20",{"$nulls":5},{"$f":"IF(F27*E27=0,\"\",VLOOKUP(E27,Lists!B$10:G$14,CEILING(F27-0.5,1)+1,TRUE))","v":""},{"$nulls":6},{"$f":"IF(M27*L27=0,\"\",VLOOKUP(L27,Lists!B$10:G$14,CEILING(M27-0.5,1)+1,TRUE))","v":""},{"$nulls":10},{"v":-10,"d":"-10.00"},{"v":-10,"d":"-10.00"},{"v":-10,"d":"-10.00"},{"v":-10,"d":"-10.00"}]
[{"$nulls":28},"X-forskyv","Y-forskyv"]
[{"$nulls":28},-0.85,-0.5]
[{"$nulls":24},"X-Konsekvens","Y-Sannsynlighet",null,null,-0.85,-0.25]
[{"$f":"A3","v":"Mål / krav nr 17:"},{"$nulls":22},"Gj sn",{"$f":"IF(F6=\"\",-10,F6-0.5)","v":{"v":-10,"d":"-10.00"}},{"$f":"IF(E6=\"\",-10,E6-0.5)","v":{"v":-10,"d":"-10.00"}},null,null,-0.85,-0.75]
[{"$f":"IF(A4=\"\",\"\",A4)","v":""},{"$nulls":23},{"$f":"IF(M6=\"\",Y31,M6-0.6)","v":{"v":-10,"d":"-10.00"}},{"$f":"IF(L6=\"\",Z31,L6-0.6)","v":{"v":-10,"d":"-10.00"}},null,null,-0.75,-0.5]
[{"$nulls":23},{"$f":"A8","v":"R1"},{"$f":"Y8","v":{"v":-10,"d":"-10.00"}},{"$f":"Z8","v":-10},null,null,-0.75,-0.25]
[null,null,"Når risikovurdering før og etter tiltak er utfylt er:",{"$nulls":21},{"$f":"AA8","v":{"v":-10,"d":"-10.00"}},{"$f":"AB8","v":-10},null,null,-0.75,-0.75]
[null,null,"● = Risikonivå før tiltak",{"$nulls":20},{"$f":"A9","v":"R2"},{"$f":"Y9","v":-10},{"$f":"Z9","v":-10},null,null,-0.66,-0.5]
[null,null,"■ = Risikonivå etter tiltak",{"$nulls":21},{"$f":"AA9","v":{"v":-10,"d":"-10.00"}},{"$f":"AB9","v":-10},null,null,-0.66,-0.25]
[{"$nulls":23},{"$f":"A10","v":"R3"},{"$f":"Y10","v":-10},{"$f":"Z10","v":-10},null,null,-0.66,-0.75]
[{"$nulls":24},{"$f":"AA10","v":-10},{"$f":"AB10","v":-10},null,null,-0.5,-0.5]
[{"$nulls":23},{"$f":"A11","v":"R4"},{"$f":"Y11","v":-10},{"$f":"Z11","v":-10},null,null,-0.5,-0.25]
[{"$nulls":24},{"$f":"AA11","v":-10},{"$f":"AB11","v":-10},null,null,-0.5,-0.75]
[{"$nulls":23},{"$f":"A12","v":"R5"},{"$f":"Y12","v":-10},{"$f":"Z12","v":-10},null,null,-0.33,-0.5]
[{"$nulls":24},{"$f":"AA12","v":-10},{"$f":"AB12","v":-10},null,null,-0.33,-0.25]
[{"$nulls":23},{"$f":"A13","v":"R6"},{"$f":"Y13","v":-10},{"$f":"Z13","v":-10},null,null,-0.33,-0.75]
[{"$nulls":24},{"$f":"AA13","v":-10},{"$f":"AB13","v":-10},null,null,-0.25,-0.5]
[{"$nulls":23},{"$f":"A14","v":"R7"},{"$f":"Y14","v":-10},{"$f":"Z14","v":-10},null,null,-0.25,-0.25]
[{"$nulls":24},{"$f":"AA14","v":-10},{"$f":"AB14","v":-10},null,null,-0.25,-0.75]
[{"$nulls":23},{"$f":"A15","v":"R8"},{"$f":"Y15","v":-10},{"$f":"Z15","v":-10},null,null,-0.15,-0.5]
[{"$nulls":24},{"$f":"AA15","v":-10},{"$f":"AB15","v":-10},null,null,-0.15,-0.25]
[{"$nulls":23},{"$f":"A16","v":"R9"},{"$f":"Y16","v":-10},{"$f":"Z16","v":-10}]
[{"$nulls":24},{"$f":"AA16","v":-10},{"$f":"AB16","v":-10}]
[{"$nulls":23},{"$f":"A17","v":"R10"},{"$f":"Y17","v":-10},{"$f":"Z17","v":-10}]
[{"$nulls":24},{"$f":"AA17","v":-10},{"$f":"AB17","v":-10}]
[{"$nulls":23},{"$f":"A18","v":"R11"},{"$f":"Y18","v":-10},{"$f":"Z18","v":-10}]
[{"$nulls":24},{"$f":"AA18","v":-10},{"$f":"AB18","v":-10}]
[{"$nulls":23},{"$f":"A19","v":"R12"},{"$f":"Y19","v":{"v":-10,"d":"-10.00"}},{"$f":"Z19","v":-10}]
[{"$nulls":24},{"$f":"AA19","v":-10},{"$f":"AB19","v":-10}]
[{"$nulls":23},{"$f":"A20","v":"R13"},{"$f":"Y20","v":-10},{"$f":"Z20","v":-10}]
[{"$nulls":24},{"$f":"AA20","v":-10},{"$f":"AB20","v":-10}]
[{"$nulls":23},{"$f":"A21","v":"R14"},{"$f":"Y21","v":-10},{"$f":"Z21","v":-10}]
[{"$nulls":24},{"$f":"AA21","v":-10},{"$f":"AB21","v":-10}]
[{"$nulls":23},{"$f":"A22","v":"R15"},{"$f":"Y22","v":-10},{"$f":"Z22","v":-10}]
[{"$nulls":24},{"$f":"AA22","v":-10},{"$f":"AB22","v":-10}]
[{"$nulls":23},{"$f":"A23","v":"R16"},{"$f":"Y23","v":{"v":-10,"d":"-10.00"}},{"$f":"Z23","v":{"v":-10,"d":"-10.00"}}]
[{"$nulls":24},{"$f":"AA23","v":{"v":-10,"d":"-10.00"}},{"$f":"AB23","v":{"v":-10,"d":"-10.00"}}]
[{"$nulls":23},{"$f":"A24","v":"R17"},{"$f":"Y24","v":{"v":-10,"d":"-10.00"}},{"$f":"Z24","v":{"v":-10,"d":"-10.00"}}]
[{"$nulls":24},{"$f":"AA24","v":{"v":-10,"d":"-10.00"}},{"$f":"AB24","v":{"v":-10,"d":"-10.00"}}]
[{"$nulls":23},{"$f":"A25","v":"R18"},{"$f":"Y25","v":{"v":-10,"d":"-10.00"}},{"$f":"Z25","v":{"v":-10,"d":"-10.00"}}]
[{"$nulls":24},{"$f":"AA25","v":{"v":-10,"d":"-10.00"}},{"$f":"AB25","v":{"v":-10,"d":"-10.00"}}]
[{"$nulls":23},{"$f":"A26","v":"R19"},{"$f":"Y26","v":{"v":-10,"d":"-10.00"}},{"$f":"Z26","v":{"v":-10,"d":"-10.00"}}]
[{"$nulls":24},{"$f":"AA26","v":{"v":-10,"d":"-10.00"}},{"$f":"AB26","v":{"v":-10,"d":"-10.00"}}]
[{"$nulls":23},{"$f":"A27","v":"R20"},{"$f":"Y27","v":{"v":-10,"d":"-10.00"}},{"$f":"Z27","v":{"v":-10,"d":"-10.00"}}]
[{"$nulls":24},{"$f":"AA27","v":{"v":-10,"d":"-10.00"}},{"$f":"AB27","v":{"v":-10,"d":"-10.00"}}]

{"sheet":"Mål 18","index":25,"n_rows":72,"n_cols":30,"rows_kept":72,"merged":[[0,0,0,3],[0,4,0,6],[0,7,0,8],[0,11,0,13],[1,2,1,3],[1,5,1,6],[1,12,1,13],[2,0,2,2],[2,4,2,6],[2,7,2,8],[2,11,2,13],[3,0,4,3],[3,4,3,5],[3,7,4,10],[3,11,3,12],[5,24,5,25],[5,26,5,27],[30,0,30,2],[31,0,32,3],[34,2,34,3],[35,2,35,3]]}
["Risikoidentifikasjon og analyse",{"$nulls":3},"Ansvarlig:",{"$nulls":6},"Risikomatrise, \nse under"]
["Enhet:",null,{"$f":"IF(Forside!C2=\"\",\"\",Forside!C2)","v":"Tjenesteområde <<tjenesteområde>>"},null,"Dato:",{"$f":"IF(Forside!C4=\"\",\"\",Forside!C4)","v":""}]
["Mål / krav nr 18:",{"$nulls":3},"Risiko før tiltak",null,null,"Deltakere i prosessen:",{"$nulls":3},"Risiko etter tiltak"]
[{"$nulls":4},"Risiko-vurdering",null,"Risiko-nivå",{"$f":"IF(Forside!C3=\"\",\"\",Forside!C3)","v":"<<deltakere>>"},{"$nulls":3},"Risiko-vurdering",null,"Risiko-nivå"]
[{"$nulls":4},"S","K",{"$nulls":5},"S","K"]
[{"$nulls":3},"Gjsn risiko for målet:",{"$f":"IF(ISERROR(AVERAGE(E8:E27)),\"\",ROUND(AVERAGE(E8:E27),0))","v":""},{"$f":"IF(ISERROR(AVERAGE(F8:F27)),\"\",ROUND(AVERAGE(F8:F27),0))","v":""},{"$f":"IF(ISERROR(E6*F6),\"\",VLOOKUP(E6,Lists!B$10:G$14,CEILING(F6-0.5,1)+1,TRUE))","v":""},{"$nulls":4},{"$f":"IF(ISERROR(AVERAGE(L8:L27)),\"\",ROUND(AVERAGE(L8:L27),0))","v":""},{"$f":"IF(ISERROR(AVERAGE(M8:M27)),\"\",ROUND(AVERAGE(M8:M27),0))","v":""},{"$f":"IF(ISERROR(L6*M6),\"\",VLOOKUP(L6,Lists!B$10:G$14,CEILING(M6-0.5,1)+1,TRUE))","v":""},{"$nulls":10},"Før tiltak",null,"Etter tiltak"]
["Risiko nr","Kritiske suksessfaktorer","Område","Eksisterende tiltak","S","K","Risiko-nivå","Risikoeier:","Nye tiltak:","Ansvarlig:","Frist:","S","K","Risiko-nivå",{"$nulls":10},"X-forskyv konsekv","Y-forskyv Sanns","X-forskyv konsekv","Y-forskyv Sanns"]
["R1",{"$nulls":5},{"$f":"IF(F8*E8=0,\"\",VLOOKUP(E8,Lists!B$10:G$14,CEILING(F8-0.5,1)+1,TRUE))","v":""},{"$nulls":6},{"$f":"IF(M8*L8=0,\"\",VLOOKUP(L8,Lists!B$10:G$14,CEILING(M8-0.5,1)+1,TRUE))","v":""},{"$nulls":10},{"$f":"IF(F8=\"\",-10,F8+AC29)","v":{"v":-10,"d":"-10.00"}},{"$f":"IF(E8=\"\",-10,E8+AD29)","v":{"v":-10,"d":"-10.00"}},{"$f":"IF(M8=\"\",Y8,M8+AC29)","v":{"v":-10,"d":"-10.00"}},{"$f":"IF(L8=\"\",Z8,L8+AD29)","v":{"v":-10,"d":"-10.00"}}]
["R2",{"$nulls":5},{"$f":"IF(F9*E9=0,\"\",VLOOKUP(E9,Lists!B$10:G$14,CEILING(F9-0.5,1)+1,TRUE))","v":""},{"$nulls":6},{"$f":"IF(M9*L9=0,\"\",VLOOKUP(L9,Lists!B$10:G$14,CEILING(M9-0.5,1)+1,TRUE))","v":""},{"$nulls":10},{"v":-10,"d":"-10.00"},{"v":-10,"d":"-10.00"},{"v":-10,"d":"-10.00"},{"v":-10,"d":"-10.00"}]
["R3",{"$nulls":5},{"$f":"IF(F10*E10=0,\"\",VLOOKUP(E10,Lists!B$10:G$14,CEILING(F10-0.5,1)+1,TRUE))","v":""},{"$nulls":6},{"$f":"IF(M10*L10=0,\"\",VLOOKUP(L10,Lists!B$10:G$14,CEILING(M10-0.5,1)+1,TRUE))","v":""},{"$nulls":10},{"v":-10,"d":"-10.00"},{"v":-10,"d":"-10.00"},{"v":-10,"d":"-10.00"},{"v":-10,"d":"-10.00"}]
["R4",{"$nulls":5},{"$f":"IF(F11*E11=0,\"\",VLOOKUP(E11,Lists!B$10:G$14,CEILING(F11-0.5,1)+1,TRUE))","v":""},{"$nulls":6},{"$f":"IF(M11*L11=0,\"\",VLOOKUP(L11,Lists!B$10:G$14,CEILING(M11-0.5,1)+1,TRUE))","v":""},{"$nulls":10},{"v":-10,"d":"-10.00"},{"v":-10,"d":"-10.00"},{"v":-10,"d":"-10.00"},{"v":-10,"d":"-10.00"}]
["R5",{"$nulls":5},{"$f":"IF(F12*E12=0,\"\",VLOOKUP(E12,Lists!B$10:G$14,CEILING(F12-0.5,1)+1,TRUE))","v":""},{"$nulls":6},{"$f":"IF(M12*L12=0,\"\",VLOOKUP(L12,Lists!B$10:G$14,CEILING(M12-0.5,1)+1,TRUE))","v":""},{"$nulls":10},{"v":-10,"d":"-10.00"},{"v":-10,"d":"-10.00"},{"v":-10,"d":"-10.00"},{"v":-10,"d":"-10.00"}]
["R6",{"$nulls":5},{"$f":"IF(F13*E13=0,\"\",VLOOKUP(E13,Lists!B$10:G$14,CEILING(F13-0.5,1)+1,TRUE))","v":""},{"$nulls":6},{"$f":"IF(M13*L13=0,\"\",VLOOKUP(L13,Lists!B$10:G$14,CEILING(M13-0.5,1)+1,TRUE))","v":""},{"$nulls":10},{"v":-10,"d":"-10.00"},{"v":-10,"d":"-10.00"},{"v":-10,"d":"-10.00"},{"v":-10,"d":"-10.00"}]
["R7",{"$nulls":5},{"$f":"IF(F14*E14=0,\"\",VLOOKUP(E14,Lists!B$10:G$14,CEILING(F14-0.5,1)+1,TRUE))","v":""},{"$nulls":6},{"$f":"IF(M14*L14=0,\"\",VLOOKUP(L14,Lists!B$10:G$14,CEILING(M14-0.5,1)+1,TRUE))","v":""},{"$nulls":10},{"v":-10,"d":"-10.00"},{"v":-10,"d":"-10.00"},{"v":-10,"d":"-10.00"},{"v":-10,"d":"-10.00"}]
["R8",{"$nulls":5},{"$f":"IF(F15*E15=0,\"\",VLOOKUP(E15,Lists!B$10:G$14,CEILING(F15-0.5,1)+1,TRUE))","v":""},{"$nulls":6},{"$f":"IF(M15*L15=0,\"\",VLOOKUP(L15,Lists!B$10:G$14,CEILING(M15-0.5,1)+1,TRUE))","v":""},{"$nulls":10},{"v":-10,"d":"-10.00"},{"v":-10,"d":"-10.00"},{"v":-10,"d":"-10.00"},{"v":-10,"d":"-10.00"}]
["R9",{"$nulls":5},{"$f":"IF(F16*E16=0,\"\",VLOOKUP(E16,Lists!B$10:G$14,CEILING(F16-0.5,1)+1,TRUE))","v":""},{"$nulls":6},{"$f":"IF(M16*L16=0,\"\",VLOOKUP(L16,Lists!B$10:G$14,CEILING(M16-0.5,1)+1,TRUE))","v":""},{"$nulls":10},{"v":-10,"d":"-10.00"},{"v":-10,"d":"-10.00"},{"v":-10,"d":"-10.00"},{"v":-10,"d":"-10.00"}]
["R10",{"$nulls":5},{"$f":"IF(F17*E17=0,\"\",VLOOKUP(E17,Lists!B$10:G$14,CEILING(F17-0.5,1)+1,TRUE))","v":""},{"$nulls":6},{"$f":"IF(M17*L17=0,\"\",VLOOKUP(L17,Lists!B$10:G$14,CEILING(M17-0.5,1)+1,TRUE))","v":""},{"$nulls":10},{"v":-10,"d":"-10.00"},{"v":-10,"d":"-10.00"},{"v":-10,"d":"-10.00"},{"v":-10,"d":"-10.00"}]
["R11",{"$nulls":5},{"$f":"IF(F18*E18=0,\"\",VLOOKUP(E18,Lists!B$10:G$14,CEILING(F18-0.5,1)+1,TRUE))","v":""},{"$nulls":6},{"$f":"IF(M18*L18=0,\"\",VLOOKUP(L18,Lists!B$10:G$14,CEILING(M18-0.5,1)+1,TRUE))","v":""},{"$nulls":10},{"v":-10,"d":"-10.00"},{"v":-10,"d":"-10.00"},{"v":-10,"d":"-10.00"},{"v":-10,"d":"-10.00"}]
["R12",{"$nulls":5},{"$f":"IF(F19*E19=0,\"\",VLOOKUP(E19,Lists!B$10:G$14,CEILING(F19-0.5,1)+1,TRUE))","v":""},{"$nulls":6},{"$f":"IF(M19*L19=0,\"\",VLOOKUP(L19,Lists!B$10:G$14,CEILING(M19-0.5,1)+1,TRUE))","v":""},{"$nulls":10},{"v":-10,"d":"-10.00"},{"v":-10,"d":"-10.00"},{"v":-10,"d":"-10.00"},{"v":-10,"d":"-10.00"}]
["R13",{"$nulls":5},{"$f":"IF(F20*E20=0,\"\",VLOOKUP(E20,Lists!B$10:G$14,CEILING(F20-0.5,1)+1,TRUE))","v":""},{"$nulls":6},{"$f":"IF(M20*L20=0,\"\",VLOOKUP(L20,Lists!B$10:G$14,CEILING(M20-0.5,1)+1,TRUE))","v":""},{"$nulls":10},{"v":-10,"d":"-10.00"},{"v":-10,"d":"-10.00"},{"v":-10,"d":"-10.00"},{"v":-10,"d":"-10.00"}]
["R14",{"$nulls":5},{"$f":"IF(F21*E21=0,\"\",VLOOKUP(E21,Lists!B$10:G$14,CEILING(F21-0.5,1)+1,TRUE))","v":""},{"$nulls":6},{"$f":"IF(M21*L21=0,\"\",VLOOKUP(L21,Lists!B$10:G$14,CEILING(M21-0.5,1)+1,TRUE))","v":""},{"$nulls":10},{"v":-10,"d":"-10.00"},{"v":-10,"d":"-10.00"},{"v":-10,"d":"-10.00"},{"v":-10,"d":"-10.00"}]
["R15",{"$nulls":5},{"$f":"IF(F22*E22=0,\"\",VLOOKUP(E22,Lists!B$10:G$14,CEILING(F22-0.5,1)+1,TRUE))","v":""},{"$nulls":6},{"$f":"IF(M22*L22=0,\"\",VLOOKUP(L22,Lists!B$10:G$14,CEILING(M22-0.5,1)+1,TRUE))","v":""},{"$nulls":10},{"v":-10,"d":"-10.00"},{"v":-10,"d":"-10.00"},{"v":-10,"d":"-10.00"},{"v":-10,"d":"-10.00"}]
["R16",{"$nulls":5},{"$f":"IF(F23*E23=0,\"\",VLOOKUP(E23,Lists!B$10:G$14,CEILING(F23-0.5,1)+1,TRUE))","v":""},{"$nulls":6},{"$f":"IF(M23*L23=0,\"\",VLOOKUP(L23,Lists!B$10:G$14,CEILING(M23-0.5,1)+1,TRUE))","v":""},{"$nulls":10},{"v":-10,"d":"-10.00"},{"v":-10,"d":"-10.00"},{"v":-10,"d":"-10.00"},{"v":-10,"d":"-10.00"}]
["R17",{"$nulls":5},{"$f":"IF(F24*E24=0,\"\",VLOOKUP(E24,Lists!B$10:G$14,CEILING(F24-0.5,1)+1,TRUE))","v":""},{"$nulls":6},{"$f":"IF(M24*L24=0,\"\",VLOOKUP(L24,Lists!B$10:G$14,CEILING(M24-0.5,1)+1,TRUE))","v":""},{"$nulls":10},{"v":-10,"d":"-10.00"},{"v":-10,"d":"-10.00"},{"v":-10,"d":"-10.00"},{"v":-10,"d":"-10.00"}]
["R18",{"$nulls":5},{"$f":"IF(F25*E25=0,\"\",VLOOKUP(E25,Lists!B$10:G$14,CEILING(F25-0.5,1)+1,TRUE))","v":""},{"$nulls":6},{"$f":"IF(M25*L25=0,\"\",VLOOKUP(L25,Lists!B$10:G$14,CEILING(M25-0.5,1)+1,TRUE))","v":""},{"$nulls":10},{"v":-10,"d":"-10.00"},{"v":-10,"d":"-10.00"},{"v":-10,"d":"-10.00"},{"v":-10,"d":"-10.00"}]
["R19",{"$nulls":5},{"$f":"IF(F26*E26=0,\"\",VLOOKUP(E26,Lists!B$10:G$14,CEILING(F26-0.5,1)+1,TRUE))","v":""},{"$nulls":6},{"$f":"IF(M26*L26=0,\"\",VLOOKUP(L26,Lists!B$10:G$14,CEILING(M26-0.5,1)+1,TRUE))","v":""},{"$nulls":10},{"v":-10,"d":"-10.00"},{"v":-10,"d":"-10.00"},{"v":-10,"d":"-10.00"},{"v":-10,"d":"-10.00"}]
["R20",{"$nulls":5},{"$f":"IF(F27*E27=0,\"\",VLOOKUP(E27,Lists!B$10:G$14,CEILING(F27-0.5,1)+1,TRUE))","v":""},{"$nulls":6},{"$f":"IF(M27*L27=0,\"\",VLOOKUP(L27,Lists!B$10:G$14,CEILING(M27-0.5,1)+1,TRUE))","v":""},{"$nulls":10},{"v":-10,"d":"-10.00"},{"v":-10,"d":"-10.00"},{"v":-10,"d":"-10.00"},{"v":-10,"d":"-10.00"}]
[{"$nulls":28},"X-forskyv","Y-forskyv"]
[{"$nulls":28},-0.85,-0.5]
[{"$nulls":24},"X-Konsekvens","Y-Sannsynlighet",null,null,-0.85,-0.25]
[{"$f":"A3","v":"Mål / krav nr 18:"},{"$nulls":22},"Gj sn",{"$f":"IF(F6=\"\",-10,F6-0.5)","v":{"v":-10,"d":"-10.00"}},{"$f":"IF(E6=\"\",-10,E6-0.5)","v":{"v":-10,"d":"-10.00"}},null,null,-0.85,-0.75]
[{"$f":"IF(A4=\"\",\"\",A4)","v":""},{"$nulls":23},{"$f":"IF(M6=\"\",Y31,M6-0.6)","v":{"v":-10,"d":"-10.00"}},{"$f":"IF(L6=\"\",Z31,L6-0.6)","v":{"v":-10,"d":"-10.00"}},null,null,-0.75,-0.5]
[{"$nulls":23},{"$f":"A8","v":"R1"},{"$f":"Y8","v":{"v":-10,"d":"-10.00"}},{"$f":"Z8","v":-10},null,null,-0.75,-0.25]
[null,null,"Når risikovurdering før og etter tiltak er utfylt er:",{"$nulls":21},{"$f":"AA8","v":{"v":-10,"d":"-10.00"}},{"$f":"AB8","v":-10},null,null,-0.75,-0.75]
[null,null,"● = Risikonivå før tiltak",{"$nulls":20},{"$f":"A9","v":"R2"},{"$f":"Y9","v":-10},{"$f":"Z9","v":-10},null,null,-0.66,-0.5]
[null,null,"■ = Risikonivå etter tiltak",{"$nulls":21},{"$f":"AA9","v":{"v":-10,"d":"-10.00"}},{"$f":"AB9","v":-10},null,null,-0.66,-0.25]
[{"$nulls":23},{"$f":"A10","v":"R3"},{"$f":"Y10","v":-10},{"$f":"Z10","v":-10},null,null,-0.66,-0.75]
[{"$nulls":24},{"$f":"AA10","v":-10},{"$f":"AB10","v":-10},null,null,-0.5,-0.5]
[{"$nulls":23},{"$f":"A11","v":"R4"},{"$f":"Y11","v":-10},{"$f":"Z11","v":-10},null,null,-0.5,-0.25]
[{"$nulls":24},{"$f":"AA11","v":-10},{"$f":"AB11","v":-10},null,null,-0.5,-0.75]
[{"$nulls":23},{"$f":"A12","v":"R5"},{"$f":"Y12","v":-10},{"$f":"Z12","v":-10},null,null,-0.33,-0.5]
[{"$nulls":24},{"$f":"AA12","v":-10},{"$f":"AB12","v":-10},null,null,-0.33,-0.25]
[{"$nulls":23},{"$f":"A13","v":"R6"},{"$f":"Y13","v":-10},{"$f":"Z13","v":-10},null,null,-0.33,-0.75]
[{"$nulls":24},{"$f":"AA13","v":-10},{"$f":"AB13","v":-10},null,null,-0.25,-0.5]
[{"$nulls":23},{"$f":"A14","v":"R7"},{"$f":"Y14","v":-10},{"$f":"Z14","v":-10},null,null,-0.25,-0.25]
[{"$nulls":24},{"$f":"AA14","v":-10},{"$f":"AB14","v":-10},null,null,-0.25,-0.75]
[{"$nulls":23},{"$f":"A15","v":"R8"},{"$f":"Y15","v":-10},{"$f":"Z15","v":-10},null,null,-0.15,-0.5]
[{"$nulls":24},{"$f":"AA15","v":-10},{"$f":"AB15","v":-10},null,null,-0.15,-0.25]
[{"$nulls":23},{"$f":"A16","v":"R9"},{"$f":"Y16","v":-10},{"$f":"Z16","v":-10}]
[{"$nulls":24},{"$f":"AA16","v":-10},{"$f":"AB16","v":-10}]
[{"$nulls":23},{"$f":"A17","v":"R10"},{"$f":"Y17","v":-10},{"$f":"Z17","v":-10}]
[{"$nulls":24},{"$f":"AA17","v":-10},{"$f":"AB17","v":-10}]
[{"$nulls":23},{"$f":"A18","v":"R11"},{"$f":"Y18","v":-10},{"$f":"Z18","v":-10}]
[{"$nulls":24},{"$f":"AA18","v":-10},{"$f":"AB18","v":-10}]
[{"$nulls":23},{"$f":"A19","v":"R12"},{"$f":"Y19","v":{"v":-10,"d":"-10.00"}},{"$f":"Z19","v":-10}]
[{"$nulls":24},{"$f":"AA19","v":-10},{"$f":"AB19","v":-10}]
[{"$nulls":23},{"$f":"A20","v":"R13"},{"$f":"Y20","v":-10},{"$f":"Z20","v":-10}]
[{"$nulls":24},{"$f":"AA20","v":-10},{"$f":"AB20","v":-10}]
[{"$nulls":23},{"$f":"A21","v":"R14"},{"$f":"Y21","v":-10},{"$f":"Z21","v":-10}]
[{"$nulls":24},{"$f":"AA21","v":-10},{"$f":"AB21","v":-10}]
[{"$nulls":23},{"$f":"A22","v":"R15"},{"$f":"Y22","v":-10},{"$f":"Z22","v":-10}]
[{"$nulls":24},{"$f":"AA22","v":-10},{"$f":"AB22","v":-10}]
[{"$nulls":23},{"$f":"A23","v":"R16"},{"$f":"Y23","v":{"v":-10,"d":"-10.00"}},{"$f":"Z23","v":{"v":-10,"d":"-10.00"}}]
[{"$nulls":24},{"$f":"AA23","v":{"v":-10,"d":"-10.00"}},{"$f":"AB23","v":{"v":-10,"d":"-10.00"}}]
[{"$nulls":23},{"$f":"A24","v":"R17"},{"$f":"Y24","v":{"v":-10,"d":"-10.00"}},{"$f":"Z24","v":{"v":-10,"d":"-10.00"}}]
[{"$nulls":24},{"$f":"AA24","v":{"v":-10,"d":"-10.00"}},{"$f":"AB24","v":{"v":-10,"d":"-10.00"}}]
[{"$nulls":23},{"$f":"A25","v":"R18"},{"$f":"Y25","v":{"v":-10,"d":"-10.00"}},{"$f":"Z25","v":{"v":-10,"d":"-10.00"}}]
[{"$nulls":24},{"$f":"AA25","v":{"v":-10,"d":"-10.00"}},{"$f":"AB25","v":{"v":-10,"d":"-10.00"}}]
[{"$nulls":23},{"$f":"A26","v":"R19"},{"$f":"Y26","v":{"v":-10,"d":"-10.00"}},{"$f":"Z26","v":{"v":-10,"d":"-10.00"}}]
[{"$nulls":24},{"$f":"AA26","v":{"v":-10,"d":"-10.00"}},{"$f":"AB26","v":{"v":-10,"d":"-10.00"}}]
[{"$nulls":23},{"$f":"A27","v":"R20"},{"$f":"Y27","v":{"v":-10,"d":"-10.00"}},{"$f":"Z27","v":{"v":-10,"d":"-10.00"}}]
[{"$nulls":24},{"$f":"AA27","v":{"v":-10,"d":"-10.00"}},{"$f":"AB27","v":{"v":-10,"d":"-10.00"}}]

{"sheet":"Mål 19","index":26,"n_rows":72,"n_cols":30,"rows_kept":72,"merged":[[0,0,0,3],[0,4,0,6],[0,7,0,8],[0,11,0,13],[1,2,1,3],[1,5,1,6],[1,12,1,13],[2,0,2,2],[2,4,2,6],[2,7,2,8],[2,11,2,13],[3,0,4,3],[3,4,3,5],[3,7,4,10],[3,11,3,12],[5,24,5,25],[5,26,5,27],[30,0,30,2],[31,0,32,3],[34,2,34,3],[35,2,35,3]]}
["Risikoidentifikasjon og analyse",{"$nulls":3},"Ansvarlig:",{"$nulls":6},"Risikomatrise, \nse under"]
["Enhet:",null,{"$f":"IF(Forside!C2=\"\",\"\",Forside!C2)","v":"Tjenesteområde <<tjenesteområde>>"},null,"Dato:",{"$f":"IF(Forside!C4=\"\",\"\",Forside!C4)","v":""}]
["Mål / krav nr 19:",{"$nulls":3},"Risiko før tiltak",null,null,"Deltakere i prosessen:",{"$nulls":3},"Risiko etter tiltak"]
[{"$nulls":4},"Risiko-vurdering",null,"Risiko-nivå",{"$f":"IF(Forside!C3=\"\",\"\",Forside!C3)","v":"<<deltakere>>"},{"$nulls":3},"Risiko-vurdering",null,"Risiko-nivå"]
[{"$nulls":4},"S","K",{"$nulls":5},"S","K"]
[{"$nulls":3},"Gjsn risiko for målet:",{"$f":"IF(ISERROR(AVERAGE(E8:E27)),\"\",ROUND(AVERAGE(E8:E27),0))","v":""},{"$f":"IF(ISERROR(AVERAGE(F8:F27)),\"\",ROUND(AVERAGE(F8:F27),0))","v":""},{"$f":"IF(ISERROR(E6*F6),\"\",VLOOKUP(E6,Lists!B$10:G$14,CEILING(F6-0.5,1)+1,TRUE))","v":""},{"$nulls":4},{"$f":"IF(ISERROR(AVERAGE(L8:L27)),\"\",ROUND(AVERAGE(L8:L27),0))","v":""},{"$f":"IF(ISERROR(AVERAGE(M8:M27)),\"\",ROUND(AVERAGE(M8:M27),0))","v":""},{"$f":"IF(ISERROR(L6*M6),\"\",VLOOKUP(L6,Lists!B$10:G$14,CEILING(M6-0.5,1)+1,TRUE))","v":""},{"$nulls":10},"Før tiltak",null,"Etter tiltak"]
["Risiko nr","Kritiske suksessfaktorer","Område","Eksisterende tiltak","S","K","Risiko-nivå","Risikoeier:","Nye tiltak:","Ansvarlig:","Frist:","S","K","Risiko-nivå",{"$nulls":10},"X-forskyv konsekv","Y-forskyv Sanns","X-forskyv konsekv","Y-forskyv Sanns"]
["R1",{"$nulls":5},{"$f":"IF(F8*E8=0,\"\",VLOOKUP(E8,Lists!B$10:G$14,CEILING(F8-0.5,1)+1,TRUE))","v":""},{"$nulls":6},{"$f":"IF(M8*L8=0,\"\",VLOOKUP(L8,Lists!B$10:G$14,CEILING(M8-0.5,1)+1,TRUE))","v":""},{"$nulls":10},{"$f":"IF(F8=\"\",-10,F8+AC29)","v":{"v":-10,"d":"-10.00"}},{"$f":"IF(E8=\"\",-10,E8+AD29)","v":{"v":-10,"d":"-10.00"}},{"$f":"IF(M8=\"\",Y8,M8+AC29)","v":{"v":-10,"d":"-10.00"}},{"$f":"IF(L8=\"\",Z8,L8+AD29)","v":{"v":-10,"d":"-10.00"}}]
["R2",{"$nulls":5},{"$f":"IF(F9*E9=0,\"\",VLOOKUP(E9,Lists!B$10:G$14,CEILING(F9-0.5,1)+1,TRUE))","v":""},{"$nulls":6},{"$f":"IF(M9*L9=0,\"\",VLOOKUP(L9,Lists!B$10:G$14,CEILING(M9-0.5,1)+1,TRUE))","v":""},{"$nulls":10},{"v":-10,"d":"-10.00"},{"v":-10,"d":"-10.00"},{"v":-10,"d":"-10.00"},{"v":-10,"d":"-10.00"}]
["R3",{"$nulls":5},{"$f":"IF(F10*E10=0,\"\",VLOOKUP(E10,Lists!B$10:G$14,CEILING(F10-0.5,1)+1,TRUE))","v":""},{"$nulls":6},{"$f":"IF(M10*L10=0,\"\",VLOOKUP(L10,Lists!B$10:G$14,CEILING(M10-0.5,1)+1,TRUE))","v":""},{"$nulls":10},{"v":-10,"d":"-10.00"},{"v":-10,"d":"-10.00"},{"v":-10,"d":"-10.00"},{"v":-10,"d":"-10.00"}]
["R4",{"$nulls":5},{"$f":"IF(F11*E11=0,\"\",VLOOKUP(E11,Lists!B$10:G$14,CEILING(F11-0.5,1)+1,TRUE))","v":""},{"$nulls":6},{"$f":"IF(M11*L11=0,\"\",VLOOKUP(L11,Lists!B$10:G$14,CEILING(M11-0.5,1)+1,TRUE))","v":""},{"$nulls":10},{"v":-10,"d":"-10.00"},{"v":-10,"d":"-10.00"},{"v":-10,"d":"-10.00"},{"v":-10,"d":"-10.00"}]
["R5",{"$nulls":5},{"$f":"IF(F12*E12=0,\"\",VLOOKUP(E12,Lists!B$10:G$14,CEILING(F12-0.5,1)+1,TRUE))","v":""},{"$nulls":6},{"$f":"IF(M12*L12=0,\"\",VLOOKUP(L12,Lists!B$10:G$14,CEILING(M12-0.5,1)+1,TRUE))","v":""},{"$nulls":10},{"v":-10,"d":"-10.00"},{"v":-10,"d":"-10.00"},{"v":-10,"d":"-10.00"},{"v":-10,"d":"-10.00"}]
["R6",{"$nulls":5},{"$f":"IF(F13*E13=0,\"\",VLOOKUP(E13,Lists!B$10:G$14,CEILING(F13-0.5,1)+1,TRUE))","v":""},{"$nulls":6},{"$f":"IF(M13*L13=0,\"\",VLOOKUP(L13,Lists!B$10:G$14,CEILING(M13-0.5,1)+1,TRUE))","v":""},{"$nulls":10},{"v":-10,"d":"-10.00"},{"v":-10,"d":"-10.00"},{"v":-10,"d":"-10.00"},{"v":-10,"d":"-10.00"}]
["R7",{"$nulls":5},{"$f":"IF(F14*E14=0,\"\",VLOOKUP(E14,Lists!B$10:G$14,CEILING(F14-0.5,1)+1,TRUE))","v":""},{"$nulls":6},{"$f":"IF(M14*L14=0,\"\",VLOOKUP(L14,Lists!B$10:G$14,CEILING(M14-0.5,1)+1,TRUE))","v":""},{"$nulls":10},{"v":-10,"d":"-10.00"},{"v":-10,"d":"-10.00"},{"v":-10,"d":"-10.00"},{"v":-10,"d":"-10.00"}]
["R8",{"$nulls":5},{"$f":"IF(F15*E15=0,\"\",VLOOKUP(E15,Lists!B$10:G$14,CEILING(F15-0.5,1)+1,TRUE))","v":""},{"$nulls":6},{"$f":"IF(M15*L15=0,\"\",VLOOKUP(L15,Lists!B$10:G$14,CEILING(M15-0.5,1)+1,TRUE))","v":""},{"$nulls":10},{"v":-10,"d":"-10.00"},{"v":-10,"d":"-10.00"},{"v":-10,"d":"-10.00"},{"v":-10,"d":"-10.00"}]
["R9",{"$nulls":5},{"$f":"IF(F16*E16=0,\"\",VLOOKUP(E16,Lists!B$10:G$14,CEILING(F16-0.5,1)+1,TRUE))","v":""},{"$nulls":6},{"$f":"IF(M16*L16=0,\"\",VLOOKUP(L16,Lists!B$10:G$14,CEILING(M16-0.5,1)+1,TRUE))","v":""},{"$nulls":10},{"v":-10,"d":"-10.00"},{"v":-10,"d":"-10.00"},{"v":-10,"d":"-10.00"},{"v":-10,"d":"-10.00"}]
["R10",{"$nulls":5},{"$f":"IF(F17*E17=0,\"\",VLOOKUP(E17,Lists!B$10:G$14,CEILING(F17-0.5,1)+1,TRUE))","v":""},{"$nulls":6},{"$f":"IF(M17*L17=0,\"\",VLOOKUP(L17,Lists!B$10:G$14,CEILING(M17-0.5,1)+1,TRUE))","v":""},{"$nulls":10},{"v":-10,"d":"-10.00"},{"v":-10,"d":"-10.00"},{"v":-10,"d":"-10.00"},{"v":-10,"d":"-10.00"}]
["R11",{"$nulls":5},{"$f":"IF(F18*E18=0,\"\",VLOOKUP(E18,Lists!B$10:G$14,CEILING(F18-0.5,1)+1,TRUE))","v":""},{"$nulls":6},{"$f":"IF(M18*L18=0,\"\",VLOOKUP(L18,Lists!B$10:G$14,CEILING(M18-0.5,1)+1,TRUE))","v":""},{"$nulls":10},{"v":-10,"d":"-10.00"},{"v":-10,"d":"-10.00"},{"v":-10,"d":"-10.00"},{"v":-10,"d":"-10.00"}]
["R12",{"$nulls":5},{"$f":"IF(F19*E19=0,\"\",VLOOKUP(E19,Lists!B$10:G$14,CEILING(F19-0.5,1)+1,TRUE))","v":""},{"$nulls":6},{"$f":"IF(M19*L19=0,\"\",VLOOKUP(L19,Lists!B$10:G$14,CEILING(M19-0.5,1)+1,TRUE))","v":""},{"$nulls":10},{"v":-10,"d":"-10.00"},{"v":-10,"d":"-10.00"},{"v":-10,"d":"-10.00"},{"v":-10,"d":"-10.00"}]
["R13",{"$nulls":5},{"$f":"IF(F20*E20=0,\"\",VLOOKUP(E20,Lists!B$10:G$14,CEILING(F20-0.5,1)+1,TRUE))","v":""},{"$nulls":6},{"$f":"IF(M20*L20=0,\"\",VLOOKUP(L20,Lists!B$10:G$14,CEILING(M20-0.5,1)+1,TRUE))","v":""},{"$nulls":10},{"v":-10,"d":"-10.00"},{"v":-10,"d":"-10.00"},{"v":-10,"d":"-10.00"},{"v":-10,"d":"-10.00"}]
["R14",{"$nulls":5},{"$f":"IF(F21*E21=0,\"\",VLOOKUP(E21,Lists!B$10:G$14,CEILING(F21-0.5,1)+1,TRUE))","v":""},{"$nulls":6},{"$f":"IF(M21*L21=0,\"\",VLOOKUP(L21,Lists!B$10:G$14,CEILING(M21-0.5,1)+1,TRUE))","v":""},{"$nulls":10},{"v":-10,"d":"-10.00"},{"v":-10,"d":"-10.00"},{"v":-10,"d":"-10.00"},{"v":-10,"d":"-10.00"}]
["R15",{"$nulls":5},{"$f":"IF(F22*E22=0,\"\",VLOOKUP(E22,Lists!B$10:G$14,CEILING(F22-0.5,1)+1,TRUE))","v":""},{"$nulls":6},{"$f":"IF(M22*L22=0,\"\",VLOOKUP(L22,Lists!B$10:G$14,CEILING(M22-0.5,1)+1,TRUE))","v":""},{"$nulls":10},{"v":-10,"d":"-10.00"},{"v":-10,"d":"-10.00"},{"v":-10,"d":"-10.00"},{"v":-10,"d":"-10.00"}]
["R16",{"$nulls":5},{"$f":"IF(F23*E23=0,\"\",VLOOKUP(E23,Lists!B$10:G$14,CEILING(F23-0.5,1)+1,TRUE))","v":""},{"$nulls":6},{"$f":"IF(M23*L23=0,\"\",VLOOKUP(L23,Lists!B$10:G$14,CEILING(M23-0.5,1)+1,TRUE))","v":""},{"$nulls":10},{"v":-10,"d":"-10.00"},{"v":-10,"d":"-10.00"},{"v":-10,"d":"-10.00"},{"v":-10,"d":"-10.00"}]
["R17",{"$nulls":5},{"$f":"IF(F24*E24=0,\"\",VLOOKUP(E24,Lists!B$10:G$14,CEILING(F24-0.5,1)+1,TRUE))","v":""},{"$nulls":6},{"$f":"IF(M24*L24=0,\"\",VLOOKUP(L24,Lists!B$10:G$14,CEILING(M24-0.5,1)+1,TRUE))","v":""},{"$nulls":10},{"v":-10,"d":"-10.00"},{"v":-10,"d":"-10.00"},{"v":-10,"d":"-10.00"},{"v":-10,"d":"-10.00"}]
["R18",{"$nulls":5},{"$f":"IF(F25*E25=0,\"\",VLOOKUP(E25,Lists!B$10:G$14,CEILING(F25-0.5,1)+1,TRUE))","v":""},{"$nulls":6},{"$f":"IF(M25*L25=0,\"\",VLOOKUP(L25,Lists!B$10:G$14,CEILING(M25-0.5,1)+1,TRUE))","v":""},{"$nulls":10},{"v":-10,"d":"-10.00"},{"v":-10,"d":"-10.00"},{"v":-10,"d":"-10.00"},{"v":-10,"d":"-10.00"}]
["R19",{"$nulls":5},{"$f":"IF(F26*E26=0,\"\",VLOOKUP(E26,Lists!B$10:G$14,CEILING(F26-0.5,1)+1,TRUE))","v":""},{"$nulls":6},{"$f":"IF(M26*L26=0,\"\",VLOOKUP(L26,Lists!B$10:G$14,CEILING(M26-0.5,1)+1,TRUE))","v":""},{"$nulls":10},{"v":-10,"d":"-10.00"},{"v":-10,"d":"-10.00"},{"v":-10,"d":"-10.00"},{"v":-10,"d":"-10.00"}]
["R20",{"$nulls":5},{"$f":"IF(F27*E27=0,\"\",VLOOKUP(E27,Lists!B$10:G$14,CEILING(F27-0.5,1)+1,TRUE))","v":""},{"$nulls":6},{"$f":"IF(M27*L27=0,\"\",VLOOKUP(L27,Lists!B$10:G$14,CEILING(M27-0.5,1)+1,TRUE))","v":""},{"$nulls":10},{"v":-10,"d":"-10.00"},{"v":-10,"d":"-10.00"},{"v":-10,"d":"-10.00"},{"v":-10,"d":"-10.00"}]
[{"$nulls":28},"X-forskyv","Y-forskyv"]
[{"$nulls":28},-0.85,-0.5]
[{"$nulls":24},"X-Konsekvens","Y-Sannsynlighet",null,null,-0.85,-0.25]
[{"$f":"A3","v":"Mål / krav nr 19:"},{"$nulls":22},"Gj sn",{"$f":"IF(F6=\"\",-10,F6-0.5)","v":{"v":-10,"d":"-10.00"}},{"$f":"IF(E6=\"\",-10,E6-0.5)","v":{"v":-10,"d":"-10.00"}},null,null,-0.85,-0.75]
[{"$f":"IF(A4=\"\",\"\",A4)","v":""},{"$nulls":23},{"$f":"IF(M6=\"\",Y31,M6-0.6)","v":{"v":-10,"d":"-10.00"}},{"$f":"IF(L6=\"\",Z31,L6-0.6)","v":{"v":-10,"d":"-10.00"}},null,null,-0.75,-0.5]
[{"$nulls":23},{"$f":"A8","v":"R1"},{"$f":"Y8","v":{"v":-10,"d":"-10.00"}},{"$f":"Z8","v":-10},null,null,-0.75,-0.25]
[null,null,"Når risikovurdering før og etter tiltak er utfylt er:",{"$nulls":21},{"$f":"AA8","v":{"v":-10,"d":"-10.00"}},{"$f":"AB8","v":-10},null,null,-0.75,-0.75]
[null,null,"● = Risikonivå før tiltak",{"$nulls":20},{"$f":"A9","v":"R2"},{"$f":"Y9","v":-10},{"$f":"Z9","v":-10},null,null,-0.66,-0.5]
[null,null,"■ = Risikonivå etter tiltak",{"$nulls":21},{"$f":"AA9","v":{"v":-10,"d":"-10.00"}},{"$f":"AB9","v":-10},null,null,-0.66,-0.25]
[{"$nulls":23},{"$f":"A10","v":"R3"},{"$f":"Y10","v":-10},{"$f":"Z10","v":-10},null,null,-0.66,-0.75]
[{"$nulls":24},{"$f":"AA10","v":-10},{"$f":"AB10","v":-10},null,null,-0.5,-0.5]
[{"$nulls":23},{"$f":"A11","v":"R4"},{"$f":"Y11","v":-10},{"$f":"Z11","v":-10},null,null,-0.5,-0.25]
[{"$nulls":24},{"$f":"AA11","v":-10},{"$f":"AB11","v":-10},null,null,-0.5,-0.75]
[{"$nulls":23},{"$f":"A12","v":"R5"},{"$f":"Y12","v":-10},{"$f":"Z12","v":-10},null,null,-0.33,-0.5]
[{"$nulls":24},{"$f":"AA12","v":-10},{"$f":"AB12","v":-10},null,null,-0.33,-0.25]
[{"$nulls":23},{"$f":"A13","v":"R6"},{"$f":"Y13","v":-10},{"$f":"Z13","v":-10},null,null,-0.33,-0.75]
[{"$nulls":24},{"$f":"AA13","v":-10},{"$f":"AB13","v":-10},null,null,-0.25,-0.5]
[{"$nulls":23},{"$f":"A14","v":"R7"},{"$f":"Y14","v":-10},{"$f":"Z14","v":-10},null,null,-0.25,-0.25]
[{"$nulls":24},{"$f":"AA14","v":-10},{"$f":"AB14","v":-10},null,null,-0.25,-0.75]
[{"$nulls":23},{"$f":"A15","v":"R8"},{"$f":"Y15","v":-10},{"$f":"Z15","v":-10},null,null,-0.15,-0.5]
[{"$nulls":24},{"$f":"AA15","v":-10},{"$f":"AB15","v":-10},null,null,-0.15,-0.25]
[{"$nulls":23},{"$f":"A16","v":"R9"},{"$f":"Y16","v":-10},{"$f":"Z16","v":-10}]
[{"$nulls":24},{"$f":"AA16","v":-10},{"$f":"AB16","v":-10}]
[{"$nulls":23},{"$f":"A17","v":"R10"},{"$f":"Y17","v":-10},{"$f":"Z17","v":-10}]
[{"$nulls":24},{"$f":"AA17","v":-10},{"$f":"AB17","v":-10}]
[{"$nulls":23},{"$f":"A18","v":"R11"},{"$f":"Y18","v":-10},{"$f":"Z18","v":-10}]
[{"$nulls":24},{"$f":"AA18","v":-10},{"$f":"AB18","v":-10}]
[{"$nulls":23},{"$f":"A19","v":"R12"},{"$f":"Y19","v":{"v":-10,"d":"-10.00"}},{"$f":"Z19","v":-10}]
[{"$nulls":24},{"$f":"AA19","v":-10},{"$f":"AB19","v":-10}]
[{"$nulls":23},{"$f":"A20","v":"R13"},{"$f":"Y20","v":-10},{"$f":"Z20","v":-10}]
[{"$nulls":24},{"$f":"AA20","v":-10},{"$f":"AB20","v":-10}]
[{"$nulls":23},{"$f":"A21","v":"R14"},{"$f":"Y21","v":-10},{"$f":"Z21","v":-10}]
[{"$nulls":24},{"$f":"AA21","v":-10},{"$f":"AB21","v":-10}]
[{"$nulls":23},{"$f":"A22","v":"R15"},{"$f":"Y22","v":-10},{"$f":"Z22","v":-10}]
[{"$nulls":24},{"$f":"AA22","v":-10},{"$f":"AB22","v":-10}]
[{"$nulls":23},{"$f":"A23","v":"R16"},{"$f":"Y23","v":{"v":-10,"d":"-10.00"}},{"$f":"Z23","v":{"v":-10,"d":"-10.00"}}]
[{"$nulls":24},{"$f":"AA23","v":{"v":-10,"d":"-10.00"}},{"$f":"AB23","v":{"v":-10,"d":"-10.00"}}]
[{"$nulls":23},{"$f":"A24","v":"R17"},{"$f":"Y24","v":{"v":-10,"d":"-10.00"}},{"$f":"Z24","v":{"v":-10,"d":"-10.00"}}]
[{"$nulls":24},{"$f":"AA24","v":{"v":-10,"d":"-10.00"}},{"$f":"AB24","v":{"v":-10,"d":"-10.00"}}]
[{"$nulls":23},{"$f":"A25","v":"R18"},{"$f":"Y25","v":{"v":-10,"d":"-10.00"}},{"$f":"Z25","v":{"v":-10,"d":"-10.00"}}]
[{"$nulls":24},{"$f":"AA25","v":{"v":-10,"d":"-10.00"}},{"$f":"AB25","v":{"v":-10,"d":"-10.00"}}]
[{"$nulls":23},{"$f":"A26","v":"R19"},{"$f":"Y26","v":{"v":-10,"d":"-10.00"}},{"$f":"Z26","v":{"v":-10,"d":"-10.00"}}]
[{"$nulls":24},{"$f":"AA26","v":{"v":-10,"d":"-10.00"}},{"$f":"AB26","v":{"v":-10,"d":"-10.00"}}]
[{"$nulls":23},{"$f":"A27","v":"R20"},{"$f":"Y27","v":{"v":-10,"d":"-10.00"}},{"$f":"Z27","v":{"v":-10,"d":"-10.00"}}]
[{"$nulls":24},{"$f":"AA27","v":{"v":-10,"d":"-10.00"}},{"$f":"AB27","v":{"v":-10,"d":"-10.00"}}]

{"sheet":"Mål 20","index":27,"n_rows":72,"n_cols":30,"rows_kept":72,"merged":[[0,0,0,3],[0,4,0,6],[0,7,0,8],[0,11,0,13],[1,2,1,3],[1,5,1,6],[1,12,1,13],[2,0,2,2],[2,4,2,6],[2,7,2,8],[2,11,2,13],[3,0,4,3],[3,4,3,5],[3,7,4,10],[3,11,3,12],[5,24,5,25],[5,26,5,27],[30,0,30,2],[31,0,32,3],[34,2,34,3],[35,2,35,3]]}
["Risikoidentifikasjon og analyse",{"$nulls":3},"Ansvarlig:",{"$nulls":6},"Risikomatrise, \nse under"]
["Enhet:",null,{"$f":"IF(Forside!C2=\"\",\"\",Forside!C2)","v":"Tjenesteområde <<tjenesteområde>>"},null,"Dato:",{"$f":"IF(Forside!C4=\"\",\"\",Forside!C4)","v":""}]
["Mål / krav nr 20:",{"$nulls":3},"Risiko før tiltak",null,null,"Deltakere i prosessen:",{"$nulls":3},"Risiko etter tiltak"]
[{"$nulls":4},"Risiko-vurdering",null,"Risiko-nivå",{"$f":"IF(Forside!C3=\"\",\"\",Forside!C3)","v":"<<deltakere>>"},{"$nulls":3},"Risiko-vurdering",null,"Risiko-nivå"]
[{"$nulls":4},"S","K",{"$nulls":5},"S","K"]
[{"$nulls":3},"Gjsn risiko for målet:",{"$f":"IF(ISERROR(AVERAGE(E8:E27)),\"\",ROUND(AVERAGE(E8:E27),0))","v":""},{"$f":"IF(ISERROR(AVERAGE(F8:F27)),\"\",ROUND(AVERAGE(F8:F27),0))","v":""},{"$f":"IF(ISERROR(E6*F6),\"\",VLOOKUP(E6,Lists!B$10:G$14,CEILING(F6-0.5,1)+1,TRUE))","v":""},{"$nulls":4},{"$f":"IF(ISERROR(AVERAGE(L8:L27)),\"\",ROUND(AVERAGE(L8:L27),0))","v":""},{"$f":"IF(ISERROR(AVERAGE(M8:M27)),\"\",ROUND(AVERAGE(M8:M27),0))","v":""},{"$f":"IF(ISERROR(L6*M6),\"\",VLOOKUP(L6,Lists!B$10:G$14,CEILING(M6-0.5,1)+1,TRUE))","v":""},{"$nulls":10},"Før tiltak",null,"Etter tiltak"]
["Risiko nr","Kritiske suksessfaktorer","Område","Eksisterende tiltak","S","K","Risiko-nivå","Risikoeier:","Nye tiltak:","Ansvarlig:","Frist:","S","K","Risiko-nivå",{"$nulls":10},"X-forskyv konsekv","Y-forskyv Sanns","X-forskyv konsekv","Y-forskyv Sanns"]
["R1",{"$nulls":5},{"$f":"IF(F8*E8=0,\"\",VLOOKUP(E8,Lists!B$10:G$14,CEILING(F8-0.5,1)+1,TRUE))","v":""},{"$nulls":6},{"$f":"IF(M8*L8=0,\"\",VLOOKUP(L8,Lists!B$10:G$14,CEILING(M8-0.5,1)+1,TRUE))","v":""},{"$nulls":10},{"$f":"IF(F8=\"\",-10,F8+AC29)","v":{"v":-10,"d":"-10.00"}},{"$f":"IF(E8=\"\",-10,E8+AD29)","v":{"v":-10,"d":"-10.00"}},{"$f":"IF(M8=\"\",Y8,M8+AC29)","v":{"v":-10,"d":"-10.00"}},{"$f":"IF(L8=\"\",Z8,L8+AD29)","v":{"v":-10,"d":"-10.00"}}]
["R2",{"$nulls":5},{"$f":"IF(F9*E9=0,\"\",VLOOKUP(E9,Lists!B$10:G$14,CEILING(F9-0.5,1)+1,TRUE))","v":""},{"$nulls":6},{"$f":"IF(M9*L9=0,\"\",VLOOKUP(L9,Lists!B$10:G$14,CEILING(M9-0.5,1)+1,TRUE))","v":""},{"$nulls":10},{"v":-10,"d":"-10.00"},{"v":-10,"d":"-10.00"},{"v":-10,"d":"-10.00"},{"v":-10,"d":"-10.00"}]
["R3",{"$nulls":5},{"$f":"IF(F10*E10=0,\"\",VLOOKUP(E10,Lists!B$10:G$14,CEILING(F10-0.5,1)+1,TRUE))","v":""},{"$nulls":6},{"$f":"IF(M10*L10=0,\"\",VLOOKUP(L10,Lists!B$10:G$14,CEILING(M10-0.5,1)+1,TRUE))","v":""},{"$nulls":10},{"v":-10,"d":"-10.00"},{"v":-10,"d":"-10.00"},{"v":-10,"d":"-10.00"},{"v":-10,"d":"-10.00"}]
["R4",{"$nulls":5},{"$f":"IF(F11*E11=0,\"\",VLOOKUP(E11,Lists!B$10:G$14,CEILING(F11-0.5,1)+1,TRUE))","v":""},{"$nulls":6},{"$f":"IF(M11*L11=0,\"\",VLOOKUP(L11,Lists!B$10:G$14,CEILING(M11-0.5,1)+1,TRUE))","v":""},{"$nulls":10},{"v":-10,"d":"-10.00"},{"v":-10,"d":"-10.00"},{"v":-10,"d":"-10.00"},{"v":-10,"d":"-10.00"}]
["R5",{"$nulls":5},{"$f":"IF(F12*E12=0,\"\",VLOOKUP(E12,Lists!B$10:G$14,CEILING(F12-0.5,1)+1,TRUE))","v":""},{"$nulls":6},{"$f":"IF(M12*L12=0,\"\",VLOOKUP(L12,Lists!B$10:G$14,CEILING(M12-0.5,1)+1,TRUE))","v":""},{"$nulls":10},{"v":-10,"d":"-10.00"},{"v":-10,"d":"-10.00"},{"v":-10,"d":"-10.00"},{"v":-10,"d":"-10.00"}]
["R6",{"$nulls":5},{"$f":"IF(F13*E13=0,\"\",VLOOKUP(E13,Lists!B$10:G$14,CEILING(F13-0.5,1)+1,TRUE))","v":""},{"$nulls":6},{"$f":"IF(M13*L13=0,\"\",VLOOKUP(L13,Lists!B$10:G$14,CEILING(M13-0.5,1)+1,TRUE))","v":""},{"$nulls":10},{"v":-10,"d":"-10.00"},{"v":-10,"d":"-10.00"},{"v":-10,"d":"-10.00"},{"v":-10,"d":"-10.00"}]
["R7",{"$nulls":5},{"$f":"IF(F14*E14=0,\"\",VLOOKUP(E14,Lists!B$10:G$14,CEILING(F14-0.5,1)+1,TRUE))","v":""},{"$nulls":6},{"$f":"IF(M14*L14=0,\"\",VLOOKUP(L14,Lists!B$10:G$14,CEILING(M14-0.5,1)+1,TRUE))","v":""},{"$nulls":10},{"v":-10,"d":"-10.00"},{"v":-10,"d":"-10.00"},{"v":-10,"d":"-10.00"},{"v":-10,"d":"-10.00"}]
["R8",{"$nulls":5},{"$f":"IF(F15*E15=0,\"\",VLOOKUP(E15,Lists!B$10:G$14,CEILING(F15-0.5,1)+1,TRUE))","v":""},{"$nulls":6},{"$f":"IF(M15*L15=0,\"\",VLOOKUP(L15,Lists!B$10:G$14,CEILING(M15-0.5,1)+1,TRUE))","v":""},{"$nulls":10},{"v":-10,"d":"-10.00"},{"v":-10,"d":"-10.00"},{"v":-10,"d":"-10.00"},{"v":-10,"d":"-10.00"}]
["R9",{"$nulls":5},{"$f":"IF(F16*E16=0,\"\",VLOOKUP(E16,Lists!B$10:G$14,CEILING(F16-0.5,1)+1,TRUE))","v":""},{"$nulls":6},{"$f":"IF(M16*L16=0,\"\",VLOOKUP(L16,Lists!B$10:G$14,CEILING(M16-0.5,1)+1,TRUE))","v":""},{"$nulls":10},{"v":-10,"d":"-10.00"},{"v":-10,"d":"-10.00"},{"v":-10,"d":"-10.00"},{"v":-10,"d":"-10.00"}]
["R10",{"$nulls":5},{"$f":"IF(F17*E17=0,\"\",VLOOKUP(E17,Lists!B$10:G$14,CEILING(F17-0.5,1)+1,TRUE))","v":""},{"$nulls":6},{"$f":"IF(M17*L17=0,\"\",VLOOKUP(L17,Lists!B$10:G$14,CEILING(M17-0.5,1)+1,TRUE))","v":""},{"$nulls":10},{"v":-10,"d":"-10.00"},{"v":-10,"d":"-10.00"},{"v":-10,"d":"-10.00"},{"v":-10,"d":"-10.00"}]
["R11",{"$nulls":5},{"$f":"IF(F18*E18=0,\"\",VLOOKUP(E18,Lists!B$10:G$14,CEILING(F18-0.5,1)+1,TRUE))","v":""},{"$nulls":6},{"$f":"IF(M18*L18=0,\"\",VLOOKUP(L18,Lists!B$10:G$14,CEILING(M18-0.5,1)+1,TRUE))","v":""},{"$nulls":10},{"v":-10,"d":"-10.00"},{"v":-10,"d":"-10.00"},{"v":-10,"d":"-10.00"},{"v":-10,"d":"-10.00"}]
["R12",{"$nulls":5},{"$f":"IF(F19*E19=0,\"\",VLOOKUP(E19,Lists!B$10:G$14,CEILING(F19-0.5,1)+1,TRUE))","v":""},{"$nulls":6},{"$f":"IF(M19*L19=0,\"\",VLOOKUP(L19,Lists!B$10:G$14,CEILING(M19-0.5,1)+1,TRUE))","v":""},{"$nulls":10},{"v":-10,"d":"-10.00"},{"v":-10,"d":"-10.00"},{"v":-10,"d":"-10.00"},{"v":-10,"d":"-10.00"}]
["R13",{"$nulls":5},{"$f":"IF(F20*E20=0,\"\",VLOOKUP(E20,Lists!B$10:G$14,CEILING(F20-0.5,1)+1,TRUE))","v":""},{"$nulls":6},{"$f":"IF(M20*L20=0,\"\",VLOOKUP(L20,Lists!B$10:G$14,CEILING(M20-0.5,1)+1,TRUE))","v":""},{"$nulls":10},{"v":-10,"d":"-10.00"},{"v":-10,"d":"-10.00"},{"v":-10,"d":"-10.00"},{"v":-10,"d":"-10.00"}]
["R14",{"$nulls":5},{"$f":"IF(F21*E21=0,\"\",VLOOKUP(E21,Lists!B$10:G$14,CEILING(F21-0.5,1)+1,TRUE))","v":""},{"$nulls":6},{"$f":"IF(M21*L21=0,\"\",VLOOKUP(L21,Lists!B$10:G$14,CEILING(M21-0.5,1)+1,TRUE))","v":""},{"$nulls":10},{"v":-10,"d":"-10.00"},{"v":-10,"d":"-10.00"},{"v":-10,"d":"-10.00"},{"v":-10,"d":"-10.00"}]
["R15",{"$nulls":5},{"$f":"IF(F22*E22=0,\"\",VLOOKUP(E22,Lists!B$10:G$14,CEILING(F22-0.5,1)+1,TRUE))","v":""},{"$nulls":6},{"$f":"IF(M22*L22=0,\"\",VLOOKUP(L22,Lists!B$10:G$14,CEILING(M22-0.5,1)+1,TRUE))","v":""},{"$nulls":10},{"v":-10,"d":"-10.00"},{"v":-10,"d":"-10.00"},{"v":-10,"d":"-10.00"},{"v":-10,"d":"-10.00"}]
["R16",{"$nulls":5},{"$f":"IF(F23*E23=0,\"\",VLOOKUP(E23,Lists!B$10:G$14,CEILING(F23-0.5,1)+1,TRUE))","v":""},{"$nulls":6},{"$f":"IF(M23*L23=0,\"\",VLOOKUP(L23,Lists!B$10:G$14,CEILING(M23-0.5,1)+1,TRUE))","v":""},{"$nulls":10},{"v":-10,"d":"-10.00"},{"v":-10,"d":"-10.00"},{"v":-10,"d":"-10.00"},{"v":-10,"d":"-10.00"}]
["R17",{"$nulls":5},{"$f":"IF(F24*E24=0,\"\",VLOOKUP(E24,Lists!B$10:G$14,CEILING(F24-0.5,1)+1,TRUE))","v":""},{"$nulls":6},{"$f":"IF(M24*L24=0,\"\",VLOOKUP(L24,Lists!B$10:G$14,CEILING(M24-0.5,1)+1,TRUE))","v":""},{"$nulls":10},{"v":-10,"d":"-10.00"},{"v":-10,"d":"-10.00"},{"v":-10,"d":"-10.00"},{"v":-10,"d":"-10.00"}]
["R18",{"$nulls":5},{"$f":"IF(F25*E25=0,\"\",VLOOKUP(E25,Lists!B$10:G$14,CEILING(F25-0.5,1)+1,TRUE))","v":""},{"$nulls":6},{"$f":"IF(M25*L25=0,\"\",VLOOKUP(L25,Lists!B$10:G$14,CEILING(M25-0.5,1)+1,TRUE))","v":""},{"$nulls":10},{"v":-10,"d":"-10.00"},{"v":-10,"d":"-10.00"},{"v":-10,"d":"-10.00"},{"v":-10,"d":"-10.00"}]
["R19",{"$nulls":5},{"$f":"IF(F26*E26=0,\"\",VLOOKUP(E26,Lists!B$10:G$14,CEILING(F26-0.5,1)+1,TRUE))","v":""},{"$nulls":6},{"$f":"IF(M26*L26=0,\"\",VLOOKUP(L26,Lists!B$10:G$14,CEILING(M26-0.5,1)+1,TRUE))","v":""},{"$nulls":10},{"v":-10,"d":"-10.00"},{"v":-10,"d":"-10.00"},{"v":-10,"d":"-10.00"},{"v":-10,"d":"-10.00"}]
["R20",{"$nulls":5},{"$f":"IF(F27*E27=0,\"\",VLOOKUP(E27,Lists!B$10:G$14,CEILING(F27-0.5,1)+1,TRUE))","v":""},{"$nulls":6},{"$f":"IF(M27*L27=0,\"\",VLOOKUP(L27,Lists!B$10:G$14,CEILING(M27-0.5,1)+1,TRUE))","v":""},{"$nulls":10},{"v":-10,"d":"-10.00"},{"v":-10,"d":"-10.00"},{"v":-10,"d":"-10.00"},{"v":-10,"d":"-10.00"}]
[{"$nulls":28},"X-forskyv","Y-forskyv"]
[{"$nulls":28},-0.85,-0.5]
[{"$nulls":24},"X-Konsekvens","Y-Sannsynlighet",null,null,-0.85,-0.25]
[{"$f":"A3","v":"Mål / krav nr 20:"},{"$nulls":22},"Gj sn",{"$f":"IF(F6=\"\",-10,F6-0.5)","v":{"v":-10,"d":"-10.00"}},{"$f":"IF(E6=\"\",-10,E6-0.5)","v":{"v":-10,"d":"-10.00"}},null,null,-0.85,-0.75]
[{"$f":"IF(A4=\"\",\"\",A4)","v":""},{"$nulls":23},{"$f":"IF(M6=\"\",Y31,M6-0.6)","v":{"v":-10,"d":"-10.00"}},{"$f":"IF(L6=\"\",Z31,L6-0.6)","v":{"v":-10,"d":"-10.00"}},null,null,-0.75,-0.5]
[{"$nulls":23},{"$f":"A8","v":"R1"},{"$f":"Y8","v":{"v":-10,"d":"-10.00"}},{"$f":"Z8","v":-10},null,null,-0.75,-0.25]
[null,null,"Når risikovurdering før og etter tiltak er utfylt er:",{"$nulls":21},{"$f":"AA8","v":{"v":-10,"d":"-10.00"}},{"$f":"AB8","v":-10},null,null,-0.75,-0.75]
[null,null,"● = Risikonivå før tiltak",{"$nulls":20},{"$f":"A9","v":"R2"},{"$f":"Y9","v":-10},{"$f":"Z9","v":-10},null,null,-0.66,-0.5]
[null,null,"■ = Risikonivå etter tiltak",{"$nulls":21},{"$f":"AA9","v":{"v":-10,"d":"-10.00"}},{"$f":"AB9","v":-10},null,null,-0.66,-0.25]
[{"$nulls":23},{"$f":"A10","v":"R3"},{"$f":"Y10","v":-10},{"$f":"Z10","v":-10},null,null,-0.66,-0.75]
[{"$nulls":24},{"$f":"AA10","v":-10},{"$f":"AB10","v":-10},null,null,-0.5,-0.5]
[{"$nulls":23},{"$f":"A11","v":"R4"},{"$f":"Y11","v":-10},{"$f":"Z11","v":-10},null,null,-0.5,-0.25]
[{"$nulls":24},{"$f":"AA11","v":-10},{"$f":"AB11","v":-10},null,null,-0.5,-0.75]
[{"$nulls":23},{"$f":"A12","v":"R5"},{"$f":"Y12","v":-10},{"$f":"Z12","v":-10},null,null,-0.33,-0.5]
[{"$nulls":24},{"$f":"AA12","v":-10},{"$f":"AB12","v":-10},null,null,-0.33,-0.25]
[{"$nulls":23},{"$f":"A13","v":"R6"},{"$f":"Y13","v":-10},{"$f":"Z13","v":-10},null,null,-0.33,-0.75]
[{"$nulls":24},{"$f":"AA13","v":-10},{"$f":"AB13","v":-10},null,null,-0.25,-0.5]
[{"$nulls":23},{"$f":"A14","v":"R7"},{"$f":"Y14","v":-10},{"$f":"Z14","v":-10},null,null,-0.25,-0.25]
[{"$nulls":24},{"$f":"AA14","v":-10},{"$f":"AB14","v":-10},null,null,-0.25,-0.75]
[{"$nulls":23},{"$f":"A15","v":"R8"},{"$f":"Y15","v":-10},{"$f":"Z15","v":-10},null,null,-0.15,-0.5]
[{"$nulls":24},{"$f":"AA15","v":-10},{"$f":"AB15","v":-10},null,null,-0.15,-0.25]
[{"$nulls":23},{"$f":"A16","v":"R9"},{"$f":"Y16","v":-10},{"$f":"Z16","v":-10}]
[{"$nulls":24},{"$f":"AA16","v":-10},{"$f":"AB16","v":-10}]
[{"$nulls":23},{"$f":"A17","v":"R10"},{"$f":"Y17","v":-10},{"$f":"Z17","v":-10}]
[{"$nulls":24},{"$f":"AA17","v":-10},{"$f":"AB17","v":-10}]
[{"$nulls":23},{"$f":"A18","v":"R11"},{"$f":"Y18","v":-10},{"$f":"Z18","v":-10}]
[{"$nulls":24},{"$f":"AA18","v":-10},{"$f":"AB18","v":-10}]
[{"$nulls":23},{"$f":"A19","v":"R12"},{"$f":"Y19","v":{"v":-10,"d":"-10.00"}},{"$f":"Z19","v":-10}]
[{"$nulls":24},{"$f":"AA19","v":-10},{"$f":"AB19","v":-10}]
[{"$nulls":23},{"$f":"A20","v":"R13"},{"$f":"Y20","v":-10},{"$f":"Z20","v":-10}]
[{"$nulls":24},{"$f":"AA20","v":-10},{"$f":"AB20","v":-10}]
[{"$nulls":23},{"$f":"A21","v":"R14"},{"$f":"Y21","v":-10},{"$f":"Z21","v":-10}]
[{"$nulls":24},{"$f":"AA21","v":-10},{"$f":"AB21","v":-10}]
[{"$nulls":23},{"$f":"A22","v":"R15"},{"$f":"Y22","v":-10},{"$f":"Z22","v":-10}]
[{"$nulls":24},{"$f":"AA22","v":-10},{"$f":"AB22","v":-10}]
[{"$nulls":23},{"$f":"A23","v":"R16"},{"$f":"Y23","v":{"v":-10,"d":"-10.00"}},{"$f":"Z23","v":{"v":-10,"d":"-10.00"}}]
[{"$nulls":24},{"$f":"AA23","v":{"v":-10,"d":"-10.00"}},{"$f":"AB23","v":{"v":-10,"d":"-10.00"}}]
[{"$nulls":23},{"$f":"A24","v":"R17"},{"$f":"Y24","v":{"v":-10,"d":"-10.00"}},{"$f":"Z24","v":{"v":-10,"d":"-10.00"}}]
[{"$nulls":24},{"$f":"AA24","v":{"v":-10,"d":"-10.00"}},{"$f":"AB24","v":{"v":-10,"d":"-10.00"}}]
[{"$nulls":23},{"$f":"A25","v":"R18"},{"$f":"Y25","v":{"v":-10,"d":"-10.00"}},{"$f":"Z25","v":{"v":-10,"d":"-10.00"}}]
[{"$nulls":24},{"$f":"AA25","v":{"v":-10,"d":"-10.00"}},{"$f":"AB25","v":{"v":-10,"d":"-10.00"}}]
[{"$nulls":23},{"$f":"A26","v":"R19"},{"$f":"Y26","v":{"v":-10,"d":"-10.00"}},{"$f":"Z26","v":{"v":-10,"d":"-10.00"}}]
[{"$nulls":24},{"$f":"AA26","v":{"v":-10,"d":"-10.00"}},{"$f":"AB26","v":{"v":-10,"d":"-10.00"}}]
[{"$nulls":23},{"$f":"A27","v":"R20"},{"$f":"Y27","v":{"v":-10,"d":"-10.00"}},{"$f":"Z27","v":{"v":-10,"d":"-10.00"}}]
[{"$nulls":24},{"$f":"AA27","v":{"v":-10,"d":"-10.00"}},{"$f":"AB27","v":{"v":-10,"d":"-10.00"}}]